program: Gaussian 09
title: 000220345
version: EM64L-G09RevD.01
frameworkgroup: C1[X(C22H29NO)]
method: RPBEPBE
basis: SDD
operation: Freq
keyword: #p
keyword: freq=noraman
keyword: PBEPBE/SDD
title: #p freq=noraman PBEPBE/SDD
converged: YES YES NO NO
title: Mulliken charges:
elementType: O N C C C C C C C C C C C C C C C C C C C C C C H H H H H H H H H H H H H H H H H H H H H H H H H H H H H
charge: -0.239536 -0.012809 0.215600 -0.116876 0.290245 -0.466117 -0.546664 -0.464015 0.288031 -0.450256 -0.595279 -0.784571 0.303019 -0.758299 -0.566231 -0.275163 -0.597676 0.155831 0.381368 -0.195817 0.074936 -0.702437 -0.725151 -0.798545 0.214129 0.219360 0.195395 0.243194 0.221108 0.219266 0.220758 0.214433 0.208888 0.239485 0.234254 0.214025 0.230292 0.233935 0.244171 0.221858 0.234595 0.235993 0.236563 0.254355 0.203124 0.212590 0.252683 0.220964 0.223453 0.200172 0.238421 0.235387 0.263564
chargesum: 0.00000
title: Mulliken charges with hydrogens summed into heavy atoms:
elementType: O N C C C C C C C C C C C C C C C C C C C C C C
charge: -0.239536 -0.012809 0.215600 0.097253 0.290245 -0.051363 -0.082362 -0.023991 0.288031 -0.026936 -0.121540 -0.106319 0.303019 -0.057675 -0.330238 -0.275163 -0.361113 0.155831 0.381368 0.058538 0.074936 -0.034040 -0.080563 -0.061173
polarizability: 3.13028000e+02 8.35368734e+00 2.48883359e+02 -4.05693182e+00 2.59701239e+00 1.70613450e+02
1716.lowfreq: -7.1205 0.0002 0.0003 0.0005 4.6544 13.4250 28.1373 34.9859 37.5526
frequency: 27.8837 34.9734 37.5149 84.7741 90.0175 99.7867 117.8808 123.2290 134.2801 144.7132 170.5061 179.0768 182.1850 186.5505 213.4345 218.5027 228.3173 236.5331 253.5785 260.5930 281.5978 301.4742 306.4407 321.7340 328.0492 335.9332 356.9774 370.5869 392.3727 403.8297 419.9432 436.3136 467.8975 476.5947 494.1531 520.6049 540.8008 554.5571 564.9400 575.1322 586.3334 632.2044 656.9801 687.4934 705.2186 711.2804 742.7450 760.6025 802.4749 829.2072 846.5594 867.7209 874.6632 897.8780 899.6785 908.8755 915.1548 919.5373 928.7101 946.5854 957.6578 958.1182 982.6923 988.0775 1012.2622 1018.8260 1024.6063 1043.8637 1065.0063 1080.3179 1087.3876 1102.0067 1109.7636 1116.1024 1128.8997 1136.0118 1153.5848 1167.6879 1188.9874 1194.7681 1199.3526 1213.3354 1221.6529 1230.1660 1260.8463 1267.6314 1284.7391 1288.7844 1293.2527 1306.8296 1327.2805 1331.7109 1334.7409 1338.8903 1341.1687 1351.9821 1366.5703 1368.0937 1371.5684 1380.1856 1383.0110 1387.0555 1394.5915 1396.9371 1449.8566 1452.6049 1456.7512 1461.0446 1461.8894 1463.4311 1466.7447 1468.2198 1469.5645 1474.3684 1483.3358 1483.7244 1488.0072 1489.7120 1492.6298 1495.4717 1542.7464 1582.3800 1613.5697 2173.5193 2938.5014 2961.0099 2972.4188 2972.9056 2975.4628 2984.2865 2984.6548 2988.6877 2991.6319 2998.4402 3003.7028 3022.3025 3033.2893 3034.3960 3039.1506 3051.9370 3055.0209 3062.6871 3072.6850 3073.7078 3075.0610 3075.4430 3092.5845 3098.1065 3098.1644 3119.1333 3122.0987 3128.4262 3159.1412
redmass: 4.1262 3.4575 4.5347 3.7419 3.6827 3.8782 2.6949 4.1657 2.0182 1.7822 2.4980 2.0352 1.2392 1.8853 1.9605 2.0492 1.8489 2.3615 1.2427 1.8602 2.3236 2.4981 2.8438 2.8123 3.0305 3.0989 2.4419 4.6392 3.1182 2.9849 3.0779 3.0784 3.3830 3.0287 3.4114 3.0428 2.4129 5.0467 3.3371 4.7135 3.1434 3.3814 4.0828 4.3343 3.6782 3.9065 2.9101 3.0992 2.6038 1.9980 1.5899 2.3429 2.5652 1.7887 1.6197 2.0429 1.5479 1.2396 2.4933 1.8513 2.0794 1.3957 1.6281 2.0935 2.1117 1.8227 2.0146 2.0721 2.3519 1.8030 1.7590 2.0416 2.7037 2.3046 2.0708 2.1060 2.1173 2.5072 2.3856 1.6350 1.6287 2.2947 1.4890 1.9940 1.7931 3.0013 1.3831 1.3327 1.5467 1.4500 1.3693 1.5554 1.7464 1.5616 1.3542 1.4847 1.2688 1.3528 1.2219 2.7873 1.3278 1.7650 1.2469 1.5160 1.1202 1.0931 1.0806 1.0617 1.0594 1.0761 1.0585 1.0671 1.0707 1.0804 1.1614 1.0869 1.1530 1.0647 1.2388 1.4043 5.7499 7.8413 6.4300 12.6646 1.0823 1.0644 1.0357 1.0601 1.0361 1.0599 1.0378 1.0598 1.0416 1.0611 1.0369 1.0934 1.0976 1.0850 1.1012 1.1032 1.1019 1.0995 1.0963 1.0979 1.0993 1.0976 1.0995 1.0984 1.0987 1.0976 1.0996 1.0894 1.0879
irintensity: 2.1128 2.0669 0.6833 2.6179 2.9367 1.9395 0.2476 1.4118 1.0678 0.4249 1.7384 0.3417 0.4927 0.6584 0.6143 1.1903 0.7528 0.7406 0.1336 0.1969 1.3335 1.4047 0.4448 1.4323 0.6534 0.4860 1.6828 0.2471 0.3499 1.2540 0.2964 2.7844 2.7656 0.5132 1.2318 3.0639 0.2952 0.2147 6.8615 2.6346 3.4205 8.8990 1.3119 0.1203 3.0363 0.0473 1.3646 2.3152 3.6147 0.4385 3.8823 1.8964 0.8195 8.2510 7.0033 5.9072 17.3416 9.0212 9.8990 5.6170 24.1443 0.3136 7.6514 3.6280 12.9304 1.6091 3.6103 11.7972 10.3835 6.5830 17.2715 6.6656 7.1320 4.8238 1.8658 4.7299 5.8321 12.0595 6.8048 6.1278 5.1530 3.3309 10.7425 53.5767 6.3113 150.1823 12.9816 3.6521 3.6557 5.4166 1.7076 0.7140 6.2828 1.4163 1.3154 2.5157 34.4961 9.4844 21.4278 1.3141 2.9630 4.7563 21.4878 29.3897 39.1155 7.0039 3.4994 3.0575 2.5227 13.4258 16.2170 10.2858 25.9822 13.5337 12.1472 14.4956 15.2237 2.1019 2.2450 29.7557 92.9917 141.4321 46.6306 14.5287 14.8148 17.0617 23.3342 34.4021 44.0989 20.0164 4.8324 25.0355 22.5642 26.1630 27.3463 26.5048 31.6474 4.3041 37.2630 35.1120 45.5825 3.5689 11.0003 59.1848 71.5151 25.2512 36.1038 42.7264 10.9939 24.1994 17.9223 15.3131 8.2261
temp: 298.150 k
press: 1.00000 atm
elementType: 8 7 6 6 6 6 6 6 6 6 6 6 6 6 6 6 6 6 6 6 6 6 6 6 1 1 1 1 1 1 1 1 1 1 1 1 1 1 1 1 1 1 1 1 1 1 1 1 1 1 1 1 1
symmnumber: 1
zpe: 1192711.4 jmol-1
zpe.correction: 0.454280 hartree
zpe.thermalcorrener: 0.478674 hartree
zpe.thermalcorrenthalpy: 0.479619 hartree
zpe.thermalcorrgfe: 0.401759 hartree
zpe.sumelectzpe: -983.915494 hartree
zpe.sumelectthermal: -983.891099 hartree
zpe.sumelectthermalent: -983.890155 hartree
zpe.sumelectthermalfe: -983.968015 hartree
dipole: -1.4362 2.5823 2.8736
dipole: 4.1217
quadrupole: -176.9401 -142.1393 -148.6656
quadrupole: -22.0812 -6.7069 -5.0126
quadrupole: -21.0251 13.7757 7.2494 -22.0812 -6.7069 -5.0126
hfenergy: -984.3697736 hartree
pointgroup: C01 [X(C22H29N1O1)]
dipole: -0.4744706 -1.0537786 -1.1375325 debye
polarizability: 313.5936492|-4.2439605|248.0993683|7.0051954|2.4936633|170.8317913 unknown
InChI: InChI=1S/C22H29NO/c1-14(2)17-11-16-7-8-20-21(4,13-23)9-6-10-22(20,5)19(16)12-18(17)15(3)24/h11-12,14,20H,6-10H2,1-5H3
charge 0 multiplicity 1
53 atoms
O  4.917075 -1.292294 0.507166
N  -5.082738 1.866222 1.266319
C  -1.208767 -0.735918 -0.52199
C  -2.236261 0.375791 -0.08888
C  -3.753296 -0.067248 -0.03249
C  -1.439228 -1.987337 0.385998
C  -2.001986 1.68577 -0.871942
C  -3.879456 -1.367007 0.836114
C  0.215907 -0.149953 -0.326678
C  -2.906433 -2.472709 0.377645
C  -0.640637 2.28621 -0.467623
C  -1.29443 -1.170422 -2.020559
C  0.473922 1.251366 -0.360685
C  -4.451097 -0.239705 -1.416593
C  1.327463 -1.009948 -0.193841
C  -4.487653 1.010667 0.683456
C  1.810301 1.707942 -0.265762
C  2.669862 -0.556412 -0.069752
C  2.930514 0.859776 -0.11755
C  4.330597 1.476994 -0.005852
C  3.749175 -1.586726 0.104884
C  4.670634 1.747159 1.488454
C  4.510256 2.766555 -0.844909
C  3.43291 -3.055704 -0.202088
H  -1.981398 0.593263 0.973306
H  -1.144618 -1.735748 1.425247
H  -0.787238 -2.819528 0.059149
H  -2.80314 2.415788 -0.651733
H  -2.027209 1.497842 -1.961075
H  -4.925102 -1.727017 0.802978
H  -3.65934 -1.110537 1.891119
H  -3.007727 -3.340095 1.057662
H  -3.185557 -2.839668 -0.628833
H  -0.749771 2.780883 0.520345
H  -0.340014 3.08388 -1.173768
H  -2.21301 -1.734374 -2.249876
H  -1.238917 -0.308104 -2.707253
H  -0.436203 -1.826012 -2.255517
H  -4.268425 0.630931 -2.068642
H  -4.093564 -1.142149 -1.934653
H  -5.542184 -0.337865 -1.278675
H  1.147592 -2.088358 -0.17569
H  1.978459 2.790016 -0.314129
H  5.061881 0.730609 -0.359594
H  3.950713 2.459234 1.934929
H  5.684429 2.180437 1.574265
H  4.650881 0.808531 2.066614
H  4.202117 2.617887 -1.896266
H  5.576178 3.059987 -0.839314
H  3.938829 3.620772 -0.435296
H  2.950279 -3.181553 -1.187572
H  2.757253 -3.483788 0.562929
H  4.378071 -3.619432 -0.179494
