program: Gaussian 09
title: 000220296
version: EM64L-G09RevD.01
frameworkgroup: C1[X(C10H12Cl2)]
method: RPBEPBE
basis: SDD
operation: Freq
keyword: #p
keyword: freq=noraman
keyword: PBEPBE/SDD
title: #p freq=noraman PBEPBE/SDD
converged: YES YES NO NO
title: Mulliken charges:
elementType: Cl Cl C C C C C C C C C C H H H H H H H H H H H H
charge: -0.094078 -0.094078 0.442364 0.442363 0.359530 0.359531 -0.564943 -0.611738 -0.798755 -0.798754 -0.823157 -0.823156 0.242073 0.240574 0.275959 0.268462 0.268462 0.275959 0.228079 0.233783 0.254829 0.254829 0.228079 0.233783
chargesum: 0.00000
title: Mulliken charges with hydrogens summed into heavy atoms:
elementType: Cl Cl C C C C C C C C C C
charge: -0.094078 -0.094078 0.442364 0.442363 0.359530 0.359531 -0.322869 -0.371165 -0.254334 -0.254334 -0.106466 -0.106466
polarizability: 1.76901112e+02 -3.45269513e-05 1.28496696e+02 4.64729877e-06 -4.68049233e+00 9.02472612e+01
1716.lowfreq: -0.0025 -0.0025 -0.0012 1.6768 5.7578 8.3915 43.2290 61.6127 77.1590
frequency: 43.2000 61.5994 77.1587 96.6886 129.3599 133.1615 163.0991 208.5214 263.3635 286.2535 299.0217 307.9881 367.3683 442.4284 446.1054 508.4580 520.8867 548.5734 593.0323 679.1404 696.9617 733.6537 758.8799 801.3572 887.6504 890.1348 916.5592 929.3873 987.8418 1025.4880 1044.0671 1048.4579 1096.1247 1110.7043 1129.2667 1209.4956 1211.4803 1243.2435 1244.9879 1284.2490 1293.3461 1380.6406 1398.5424 1401.6784 1401.8628 1455.9238 1463.1284 1470.0044 1470.9376 1481.1862 1484.0558 1504.4927 1572.4957 1624.9646 2973.7125 2974.0778 3052.0280 3052.2106 3067.3196 3067.6202 3091.5188 3091.7371 3116.3385 3121.5854 3146.3472 3146.7735
redmass: 17.3962 4.5505 4.2284 5.2194 1.0978 1.0668 5.4848 3.4915 3.1486 2.4765 3.0630 2.3696 5.4150 4.0445 3.0516 2.7205 4.8958 5.9258 6.0045 4.1020 5.7471 5.1120 3.1085 2.8136 1.4986 1.2958 1.5846 1.6380 1.4335 1.5379 1.5459 1.5990 3.7697 1.1688 1.1134 3.4327 1.4593 1.1431 1.1651 1.2578 6.6457 4.9358 2.4194 1.2814 1.4066 1.1119 1.2570 1.0537 1.0598 1.1287 1.1401 2.9977 6.9399 6.6330 1.0393 1.0393 1.0951 1.0950 1.0577 1.0578 1.0988 1.0989 1.0915 1.0917 1.1111 1.1109
irintensity: 0.9846 0.0190 1.2200 3.8724 1.0240 0.1325 5.4023 1.1003 6.8137 0.2834 0.4222 0.0038 7.9664 17.7621 0.7558 13.5660 2.9684 52.1122 84.1550 16.0534 7.0805 2.8012 5.8157 21.0869 3.5046 2.9935 9.7761 0.0000 0.0036 8.7649 0.0042 20.5966 21.5321 2.6403 6.8886 1.5443 19.2409 31.5701 23.3243 3.3636 14.6076 8.4445 10.9003 18.8420 3.9701 7.5177 12.6765 0.1494 38.6659 0.6034 24.4093 6.0287 7.0071 47.4387 30.3646 18.2438 0.8013 28.5443 13.0108 27.6035 1.0445 27.1134 19.1798 10.0122 2.6056 8.7948
temp: 298.150 k
press: 1.00000 atm
elementType: 17 17 6 6 6 6 6 6 6 6 6 6 1 1 1 1 1 1 1 1 1 1 1 1
symmnumber: 1
zpe: 500816.2 jmol-1
zpe.correction: 0.190751 hartree
zpe.thermalcorrener: 0.203763 hartree
zpe.thermalcorrenthalpy: 0.204707 hartree
zpe.thermalcorrgfe: 0.149974 hartree
zpe.sumelectzpe: -1307.505777 hartree
zpe.sumelectthermal: -1307.492765 hartree
zpe.sumelectthermalent: -1307.491821 hartree
zpe.sumelectthermalfe: -1307.546554 hartree
dipole: 0.0000 3.1009 3.0835
dipole: 4.3731
quadrupole: -90.9229 -83.6620 -84.6840
quadrupole: 0.0000 0.0000 -6.6617
quadrupole: -4.4999 2.7609 1.7390 0.0000 0.0000 -6.6617
hfenergy: -1307.6965279 hartree
pointgroup: C01 [X(C10H12Cl2)]
dipole: 0.0000318 1.1032582 -1.3202049 debye
dipolederiv: -0.5528404 -0.2142753 0.1066088 -0.2868569 -0.3632661 0.087304 0.4589645 0.2729295 -0.3980063 -0.5528131 0.2142718 -0.1066108 0.2868585 -0.3632766 0.0873139 -0.4589615 0.2729448 -0.3980208 -0.3195079 -0.0381569 0.0179617 0.0688835 -0.2103091 -0.0045105 -0.0915814 -0.1105985 -0.1369345 -0.3195097 0.0381616 -0.0179667 -0.0688822 -0.2103073 -0.0045122 0.091573 -0.1105994 -0.1369328 0.3595527 -0.189347 -0.0341487 -0.0509538 0.1819665 0.0174888 -0.0144249 0.0449616 0.0017856 0.3595574 0.1893418 0.0341597 0.050949 0.1819595 0.0174896 0.014438 0.0449674 0.0017872 0.1736603 -0.0000025 0.0000047 -0.0000031 -0.0008462 0.0829669 0.0000045 0.0555637 -0.1163348 -0.4877174 0.000005 -0.0000041 0.000006 0.0726142 0.0614199 -0.0000041 0.0810064 -0.1442586 0.7374173 0.3447092 -0.1863266 0.4163437 0.4078689 -0.1357274 -0.3901759 -0.2576997 0.5067805 0.7373828 -0.3447085 0.1863297 -0.4163467 0.4078856 -0.1357421 0.3901758 -0.257717 0.5067958 -0.2022895 0.1219437 0.0508687 0.0398238 0.0158813 0.0093577 0.0236284 0.0377537 0.0403551 -0.202292 -0.1219404 -0.0508757 -0.0398172 0.0158867 0.0093577 -0.0236373 0.037749 0.0403523 0.0798517 -0.0000011 -0.0000011 -0.000001 -0.0799793 -0.0665859 -0.0000009 -0.0572168 0.1073454 0.071522 -0.0000008 -0.0000013 -0.0000011 -0.1006369 -0.0669925 -0.0000015 -0.0837887 0.11745 0.0585646 0.0372994 0.0897284 -0.0532412 -0.0410842 -0.0573281 0.0540038 -0.0355458 -0.0356651 -0.0705097 -0.0016499 -0.0190012 0.0578924 0.0236972 0.1020214 0.0341178 0.0886043 -0.0074726 -0.0705103 0.0016497 0.0190017 -0.0578932 0.0236984 0.1020196 -0.0341177 0.0886051 -0.007473 0.0585691 -0.0373009 -0.0897273 0.0532405 -0.0410849 -0.0573252 -0.054002 -0.035546 -0.0356693 -0.0121824 0.0604042 -0.0787009 0.0518091 0.0779078 -0.0167782 -0.117579 0.0277543 -0.0662498 0.0782195 -0.08771 -0.0365405 0.0180236 -0.1044254 -0.0832162 0.004641 -0.0922733 0.0763637 0.0049199 -0.0076207 0.0599502 -0.0363509 0.0661842 0.0759878 0.0936561 0.0263315 0.0369426 0.0049259 0.0076205 -0.0599497 0.0363484 0.0661836 0.0759907 -0.0936566 0.0263345 0.0369369 -0.0121914 -0.0604019 0.0787028 -0.0518055 0.0779108 -0.0167834 0.1175825 0.0277486 -0.0662436 0.0782204 0.0877091 0.0365381 -0.0180258 -0.1044286 -0.0832162 -0.0046425 -0.0922692 0.076366 unknown
polarizability: 176.9011123|-0.0005182|129.03044|0.0011753|1.0985062|89.7135172 unknown
InChI: InChI=1S/C10H12Cl2/c1-7-3-8(2)10(6-12)4-9(7)5-11/h3-4H,5-6H2,1-2H3
charge 0 multiplicity 1
24 atoms
Cl -3.302451 -1.707064 0.966169
Cl 3.302392 -1.707138 0.966256
C  -1.238629 -0.309979 -0.419462
C  1.238638 -0.310007 -0.41943
C  -1.243482 1.050465 0.016953
C  1.243511 1.050437 0.016987
C  0.0000 -0.96296 -0.621329
C  0.000019 1.693105 0.226116
C  -2.511333 -1.054575 -0.673059
C  2.511333 -1.054631 -0.672992
C  -2.541672 1.793387 0.267132
C  2.541711 1.793328 0.267202
H  -0.000008 -2.014005 -0.937373
H  0.000026 2.735594 0.567153
H  -2.363216 -1.967529 -1.266076
H  -3.313279 -0.437853 -1.102307
H  3.313303 -0.437927 -1.102219
H  2.36321 -1.967582 -1.266014
H  -3.111723 1.947637 -0.670066
H  -2.352968 2.786707 0.70703
H  -3.197221 1.228923 0.955412
H  3.197223 1.228853 0.955508
H  3.111798 1.947556 -0.669978
H  2.353017 2.786656 0.707086
