program: Gaussian 09
title: 000220298
version: EM64L-G09RevD.01
frameworkgroup: C1[X(C21H16)]
method: RPBEPBE
basis: SDD
operation: Freq
keyword: #p
keyword: freq=noraman
keyword: PBEPBE/SDD
title: #p freq=noraman PBEPBE/SDD
converged: YES YES NO NO
title: Mulliken charges:
elementType: C C C C C C C C C C C C C C C C C C C C C H H H H H H H H H H H H H H H H
charge: -0.700066 0.156700 0.069288 0.291290 0.127297 0.293107 0.297530 -0.429261 -0.391879 -0.241911 -0.245590 -0.374425 -0.379922 -0.392541 -0.421198 -0.252097 -0.239908 -0.225098 -0.236281 -0.251263 -0.247089 0.232619 0.254157 0.242682 0.260292 0.224229 0.224312 0.221171 0.259656 0.255106 0.256647 0.223674 0.227557 0.227242 0.226688 0.228673 0.228610
chargesum: 0.00000
title: Mulliken charges with hydrogens summed into heavy atoms:
elementType: C C C C C C C C C C C C C C C C C C C C C
charge: -0.213290 0.156700 0.069288 0.291290 0.127297 0.293107 0.297530 -0.186579 -0.131586 -0.017683 -0.021278 -0.153254 -0.120267 -0.137434 -0.164550 -0.028423 -0.012351 0.002144 -0.009593 -0.022590 -0.018479
polarizability: 3.31516906e+02 -8.40215878e+00 2.64281674e+02 9.28381015e+00 -1.51345196e+01 1.23277568e+02
1716.lowfreq: -7.8698 -2.8839 -0.0007 0.0002 0.0006 2.8970 29.5230 51.2764 57.4636
frequency: 29.4734 51.2726 57.4604 65.6668 81.2271 106.1126 174.8088 190.1387 226.3719 249.6119 271.8519 286.5261 341.1860 371.0576 402.3927 404.2831 422.9065 467.0585 495.6442 524.9115 549.4298 592.8698 603.3689 612.8210 617.0343 651.7628 657.5151 693.2582 697.5522 704.7865 728.1756 758.9503 768.6560 780.3908 807.4977 846.0761 857.5343 868.1850 870.8686 911.4371 924.8652 926.7808 936.3151 956.3398 975.0422 980.0115 985.2464 986.8473 988.3999 993.9219 995.9571 1015.7086 1024.5506 1028.5440 1043.6860 1079.5738 1086.0495 1101.4358 1127.7722 1168.3471 1172.1601 1172.5684 1176.2947 1189.2222 1195.3041 1201.2390 1215.1530 1260.8757 1296.0894 1315.3738 1320.5270 1356.1572 1369.7494 1374.3083 1399.4141 1416.6276 1431.7172 1435.1415 1449.0989 1460.9296 1475.8805 1489.9713 1569.9361 1578.9536 1583.8119 1594.3262 1608.3417 1613.0947 1617.4799 2975.7172 3023.3953 3120.5480 3121.9465 3122.5339 3129.2001 3130.4237 3131.0860 3141.7264 3143.5834 3145.5195 3150.9101 3157.4656 3160.9817 3164.7709 3169.7436
redmass: 3.8597 4.2377 4.4882 4.5777 3.9563 4.5450 4.0520 3.5267 4.8780 3.4649 4.1247 4.9435 4.4453 4.1903 2.8430 2.8359 2.9243 3.4463 3.7747 3.2793 4.3123 5.9780 5.3905 6.0960 6.3479 4.1651 6.1165 5.4050 1.7478 1.8054 1.9056 1.7099 1.8005 2.3962 4.0548 1.2562 1.2534 3.0481 1.6309 1.5149 1.6700 1.6804 4.5435 1.6271 1.3878 1.3803 1.3422 5.5633 6.0059 1.3183 1.3164 3.2979 2.2465 2.1349 2.1348 1.6206 1.7668 1.8407 1.1597 1.1241 1.0653 1.1386 2.2907 1.1201 1.2674 1.3524 2.2808 3.1601 1.7315 1.4422 1.4903 2.9095 6.0029 6.1779 4.0622 1.2492 2.2460 2.3665 2.4714 2.9226 2.2601 2.5340 6.2334 5.8595 6.5976 7.4713 6.0191 6.4948 6.9858 1.0621 1.0969 1.0857 1.0845 1.0846 1.0878 1.0878 1.0892 1.0927 1.0935 1.0940 1.0965 1.0967 1.1001 1.1016 1.0987
irintensity: 0.1650 0.0198 0.0652 0.5677 0.4196 0.2574 0.3757 1.7404 0.0847 3.6908 2.1656 1.5537 1.2560 1.3681 0.0193 0.1376 3.5243 1.8831 6.2619 2.4644 8.7043 6.2359 13.9428 1.6343 0.6952 1.5507 1.7450 1.3580 48.0333 50.3399 30.1223 18.3801 91.2507 32.6392 5.5741 0.5883 0.5754 1.7976 0.2677 1.8680 1.9749 2.4705 4.9443 3.3272 0.7529 0.4628 0.0678 0.3012 0.4019 0.2253 0.1799 0.6063 15.6329 5.9574 3.8248 5.1042 10.7000 1.4579 2.4951 2.0122 0.0733 0.1416 3.2032 0.7263 1.1558 1.7313 4.8693 3.3452 3.9442 0.6136 2.0964 6.5857 0.5410 0.1039 11.5610 11.8378 9.3054 5.8570 5.4815 15.2606 14.8072 18.1791 0.9027 3.2174 2.4915 1.4248 11.0530 6.0250 11.3827 15.0004 7.5851 3.1541 5.1628 2.2830 1.0199 2.5514 10.7126 32.6100 32.8701 14.4486 32.4897 39.3625 40.9748 20.9464 13.4029
temp: 298.150 k
press: 1.00000 atm
elementType: 6 6 6 6 6 6 6 6 6 6 6 6 6 6 6 6 6 6 6 6 6 1 1 1 1 1 1 1 1 1 1 1 1 1 1 1 1
symmnumber: 1
zpe: 780281.2 jmol-1
zpe.correction: 0.297193 hartree
zpe.thermalcorrener: 0.313368 hartree
zpe.thermalcorrenthalpy: 0.314312 hartree
zpe.thermalcorrgfe: 0.252415 hartree
zpe.sumelectzpe: -808.430874 hartree
zpe.sumelectthermal: -808.414700 hartree
zpe.sumelectthermalent: -808.413755 hartree
zpe.sumelectthermalfe: -808.475652 hartree
dipole: 0.5015 -0.2138 0.0526
dipole: 0.5477
quadrupole: -112.6593 -105.8525 -124.4061
quadrupole: 0.9869 2.8103 -4.2747
quadrupole: 1.6467 8.4535 -10.1001 0.9869 2.8103 -4.2747
hfenergy: -808.7280673 hartree
pointgroup: C01 [X(C21H16)]
dipole: -0.1832295 -0.103034 -0.0473984 debye
polarizability: 327.217843|13.4728994|256.7446867|17.5610469|41.787795|135.1136185 unknown
InChI: InChI=1S/C21H16/c1-3-9-16(10-4-1)20-15-18-13-7-8-14-19(18)21(20)17-11-5-2-6-12-17/h1-14H,15H2
charge 0 multiplicity 1
37 atoms
C  0.940723 -2.168015 -0.397022
C  -0.106878 -1.065843 -0.213215
C  0.530999 0.145377 0.03977
C  2.259658 -1.455584 -0.179907
C  1.995698 -0.075602 0.072079
C  -1.54962 -1.379962 -0.248658
C  -0.074186 1.494873 0.201133
C  3.575841 -1.942433 -0.220288
C  3.06399 0.831044 0.267146
C  4.646867 -1.036348 -0.005716
C  4.389335 0.337071 0.230572
C  -2.020603 -2.499337 -0.997617
C  -2.511098 -0.628987 0.492165
C  -0.948298 2.025706 -0.787119
C  0.240249 2.300913 1.329917
C  -3.389275 -2.839187 -1.026324
C  -3.87771 -0.971027 0.466016
C  -1.50067 3.316261 -0.644848
C  -0.317212 3.590805 1.47551
C  -4.328885 -2.074649 -0.297051
C  -1.189349 4.104893 0.48835
H  0.891798 -2.616026 -1.410552
H  0.779211 -2.998073 0.318506
H  3.779562 -3.001821 -0.415441
H  2.872225 1.896376 0.432629
H  5.68091 -1.398382 -0.028508
H  5.228984 1.024844 0.382837
H  -1.310183 -3.102416 -1.574295
H  -2.17936 0.214272 1.104524
H  -1.18838 1.418668 -1.666743
H  0.904035 1.903115 2.106145
H  -3.722572 -3.699747 -1.617548
H  -4.592769 -0.379788 1.049263
H  -2.170511 3.708144 -1.418596
H  -0.071411 4.192419 2.357986
H  -5.392285 -2.337814 -0.316133
H  -1.618631 5.107061 0.598335
