program: Gaussian 09
title: 000220356
version: EM64L-G09RevD.01
frameworkgroup: C1[X(C23H32O3)]
method: RPBEPBE
basis: SDD
operation: Freq
keyword: #pfreq=noraman
keyword: PBEPBE/SDD
title: #p freq=noraman PBEPBE/SDD
converged: YES YES NO NO
title: Mulliken charges:
elementType: O O O C C C C C C C C C C C C C C C C C C C C C C C H H H H H H H H H H H H H H H H H H H H H H H H H H H H H H H H
charge: -0.277387 -0.234263 -0.241669 -0.108638 0.220983 0.226106 -0.464618 -0.523068 -0.501644 -0.435837 0.260635 -0.611340 -0.822842 0.314822 -0.797599 0.163380 -0.564459 -0.618682 0.157525 0.391842 -0.199574 0.070355 -0.506880 -0.723478 -0.703671 -0.796693 0.248607 0.226252 0.197008 0.217161 0.220279 0.206080 0.233139 0.203244 0.214080 0.240160 0.229895 0.228651 0.233921 0.217993 0.229120 0.239814 0.245968 0.248411 0.235449 0.254092 0.232627 0.241682 0.240857 0.199098 0.221110 0.221976 0.252009 0.211067 0.202046 0.240331 0.261077 0.233489
chargesum: 0.00000
title: Mulliken charges with hydrogens summed into heavy atoms:
elementType: O O O C C C C C C C C C C C C C C C C C C C C C C C
charge: -0.277387 -0.234263 -0.241669 0.139969 0.220983 0.226106 -0.041359 -0.085627 -0.062426 -0.018513 0.260635 -0.141284 -0.142278 0.314822 -0.082697 0.163380 -0.316048 -0.383233 0.157525 0.391842 0.054519 0.070355 0.208286 -0.081294 -0.038549 -0.061795
polarizability: 3.42923886e+02 1.74840102e+00 2.51811941e+02 -6.12202511e+00 -1.48057844e+00 1.82627535e+02
1716.lowfreq: -12.1799 -7.4899 -1.9174 -0.0003 0.0005 0.0006 27.3959 30.9283 34.7614
frequency: 27.2894 30.9144 34.7437 36.9522 70.3099 82.2006 92.5066 111.4022 125.4158 130.4210 136.1881 152.2844 165.9536 173.1309 185.3546 202.3952 211.1157 227.3992 234.4145 238.2074 245.8312 254.4342 261.9375 264.5880 284.3512 293.5021 297.7741 320.7427 331.6617 341.0465 350.1607 368.4348 392.0868 415.9873 425.6724 443.0044 460.7610 470.3253 485.1460 515.5054 527.9396 533.4148 573.2496 583.6801 621.5135 634.9143 676.5475 699.3907 702.5541 711.1786 723.6741 752.5845 762.0255 798.4929 818.0286 835.7857 874.0031 876.9748 896.3595 899.4128 904.6264 912.3648 918.7053 924.8368 941.4030 949.8100 961.0545 963.2209 984.1036 994.8119 1015.2966 1018.9973 1037.1208 1041.7440 1067.9425 1080.2646 1083.7721 1098.6817 1108.4476 1113.0869 1115.7705 1122.2327 1129.1181 1135.5552 1146.6781 1151.0131 1170.1749 1188.4857 1195.2618 1205.6759 1211.7398 1228.2518 1234.4604 1245.4808 1265.8855 1284.5974 1288.3132 1293.8773 1305.3491 1324.1643 1327.9213 1335.0296 1339.4165 1343.2306 1353.1105 1365.0804 1369.7756 1375.1983 1379.8990 1383.2069 1387.4712 1390.6411 1395.5818 1421.1400 1449.6383 1452.6501 1453.4701 1461.6266 1462.7089 1464.3156 1464.9080 1467.4552 1469.5351 1472.7771 1479.1160 1480.9894 1484.6957 1485.7705 1487.9460 1490.1185 1493.6443 1500.0961 1544.8108 1582.1788 1612.0596 1613.8974 2961.3492 2970.7914 2973.3350 2973.6170 2975.6786 2982.4645 2984.5337 2985.3059 2990.9323 2995.5433 3001.6060 3004.0658 3021.9259 3030.1790 3035.2413 3046.2597 3048.8508 3055.5906 3063.6360 3070.0787 3073.0277 3074.6859 3075.3752 3087.7432 3093.0379 3096.1236 3105.8270 3108.8246 3122.1927 3127.2423 3144.1628 3147.9503
redmass: 3.9048 6.2955 4.0716 4.1404 3.7946 3.1047 3.6754 3.5047 2.5217 1.3142 2.4203 3.0531 3.0659 1.0676 2.5954 3.1255 2.4063 1.5601 1.3316 2.0748 1.5858 1.4089 2.4009 1.4828 2.1434 2.8060 2.5479 2.6491 4.2773 3.5317 3.1496 2.7171 3.3410 3.1564 3.5058 3.1490 3.1520 3.2306 3.7214 3.4350 3.2701 3.3114 3.0686 2.7919 3.4363 3.3269 3.9270 3.9228 3.6814 3.7640 5.1214 3.9225 3.2311 2.9782 2.0843 1.7065 2.7855 1.9725 2.0062 1.7956 1.9913 1.5636 1.2245 2.8008 3.5870 1.9550 1.3933 1.9916 1.6576 1.9128 1.9988 1.8362 1.8146 2.0253 2.3455 1.8662 2.0127 2.7641 2.6825 1.2706 3.0710 2.3184 2.1936 2.4855 1.4115 1.6390 2.4921 2.5156 1.7058 2.2047 1.5241 2.1233 1.7254 1.6112 2.7248 1.3684 1.5083 1.5246 1.4895 1.3536 1.4529 1.8110 1.4384 1.6675 1.3624 1.2477 1.2188 1.3824 2.5076 1.3473 1.6176 1.2035 1.6826 1.1784 1.1175 1.0508 1.0967 1.0703 1.0702 1.0538 1.0522 1.0655 1.0678 1.0767 1.0676 1.1060 1.2022 1.0777 1.0784 1.0849 1.6469 1.0994 5.6971 7.8892 6.4489 9.6582 1.0635 1.0758 1.0353 1.0643 1.0359 1.0394 1.0379 1.0622 1.0629 1.0626 1.0368 1.0294 1.0936 1.0971 1.0850 1.1014 1.1021 1.1013 1.0994 1.0983 1.0958 1.0975 1.0994 1.0990 1.0983 1.0989 1.1044 1.0997 1.0999 1.0892 1.0886 1.1049
irintensity: 1.4960 0.4723 1.8710 0.4540 0.0525 1.6092 1.3807 0.6129 1.6105 0.1385 1.6187 1.2492 0.8089 0.3485 3.2742 1.2963 1.3754 2.5127 1.1413 1.7861 0.9527 0.3305 4.5558 2.4057 4.8192 1.4322 0.6881 0.5443 3.7558 7.7182 2.6219 1.0858 4.4230 0.2742 1.2355 2.0338 2.0856 1.2692 3.5382 0.6858 4.5391 3.0906 4.7085 4.1453 7.8240 0.9237 3.2915 2.4911 2.3597 1.2449 3.7610 1.7502 0.9881 11.0381 1.2443 2.0373 1.0124 1.6434 8.0276 7.6447 7.0653 9.1335 6.7871 14.9214 6.2969 24.6744 0.4096 32.9260 4.1783 7.6102 4.3844 2.2386 12.9278 99.0075 19.6684 2.2745 16.6280 112.7928 28.1466 0.9419 138.4136 6.3503 3.3388 20.1136 3.7906 33.0928 11.5461 21.0567 8.1839 17.5149 20.8980 26.6691 7.9845 10.2981 156.6150 5.2146 22.7658 3.4332 2.3547 3.6292 5.0705 3.2374 0.1624 3.9399 0.4592 39.8330 20.9099 6.5097 5.6242 3.5022 5.0886 19.0815 20.0223 14.3517 40.6719 13.7879 8.1714 1.1146 6.5155 17.1347 14.1418 0.7427 5.3192 3.1547 17.9445 20.9689 21.8929 6.1470 11.1595 9.5394 8.8366 19.6026 97.0576 144.0600 65.8103 118.9490 17.7962 12.5869 26.9225 21.4897 46.4342 25.1460 4.2769 22.6349 30.2115 25.7447 35.3779 41.8461 35.6382 22.8788 4.5658 44.3964 32.3244 49.9730 3.7745 36.8512 11.7585 62.1423 59.6047 35.4194 35.1148 21.6868 24.9393 19.4914 19.2547 17.2664 8.2227 16.8319
temp: 298.150 k
press: 1.00000 atm
elementType: 8 8 8 6 6 6 6 6 6 6 6 6 6 6 6 6 6 6 6 6 6 6 6 6 6 6 1 1 1 1 1 1 1 1 1 1 1 1 1 1 1 1 1 1 1 1 1 1 1 1 1 1 1 1 1 1 1 1
symmnumber: 1
zpe: 1305269.0 jmol-1
zpe.correction: 0.497151 hartree
zpe.thermalcorrener: 0.524306 hartree
zpe.thermalcorrenthalpy: 0.525250 hartree
zpe.thermalcorrgfe: 0.440689 hartree
zpe.sumelectzpe: -1119.346826 hartree
zpe.sumelectthermal: -1119.319670 hartree
zpe.sumelectthermalent: -1119.318726 hartree
zpe.sumelectthermalfe: -1119.403288 hartree
dipole: -5.3672 0.5993 0.3897
dipole: 5.4146
quadrupole: -165.0452 -149.1458 -158.7579
quadrupole: -4.0132 -0.5086 -3.2144
quadrupole: -7.3956 8.5039 -1.1083 -4.0132 -0.5086 -3.2144
hfenergy: -1119.8439767 hartree
pointgroup: C01 [X(C23H32O3)]
dipole: -2.1034237 0.2963438 0.1608167 debye
polarizability: 342.928897|-0.8789009|251.8121281|-6.4089308|-0.2551067|182.6223369 unknown
InChI: InChI=1S/C23H32O3/c1-14(2)17-12-16-8-9-20-22(4,19(16)13-18(17)15(3)24)10-7-11-23(20,5)21(25)26-6/h12-14,20H,7-11H2,1-6H3
charge 0 multiplicity 1
58 atoms
O  -5.580823 -0.28535 -0.320511
O  -3.875221 -1.378128 -1.441563
O  5.448498 1.210592 -0.244764
C  -1.840908 -0.256426 0.149298
C  -0.724694 0.823934 0.365531
C  -3.310279 0.257396 0.381733
C  -0.963237 1.995526 -0.669024
C  -1.525486 -1.569567 0.898036
C  -3.439058 1.765957 -0.045109
C  -2.433331 2.117731 -1.157261
C  0.663796 0.176793 0.126138
C  -0.267492 -2.217806 0.290029
C  -0.693617 1.408995 1.815111
C  0.877911 -1.230351 0.11807
C  -3.832664 0.086294 1.839072
C  -4.229824 -0.565457 -0.554165
C  1.792665 1.006083 -0.0556
C  2.188602 -1.726634 -0.08574
C  3.114967 0.515663 -0.236758
C  3.327104 -0.909448 -0.26338
C  4.701985 -1.563736 -0.453737
C  4.2242 1.516572 -0.38788
C  -6.545672 -1.003176 -1.187278
C  4.654065 -2.891247 -1.250226
C  5.378333 -1.782351 0.930472
C  3.869616 2.971635 -0.718339
H  -1.791882 -0.516246 -0.928543
H  -0.309621 1.847937 -1.54867
H  -0.65575 2.952046 -0.20156
H  -2.372939 -2.273741 0.802772
H  -1.374606 -1.384907 1.97892
H  -3.254667 2.404141 0.83996
H  -4.477196 1.971343 -0.362548
H  -2.613568 3.147407 -1.521062
H  -2.601445 1.448778 -2.023916
H  -0.530629 -2.634906 -0.704618
H  0.070812 -3.074999 0.903574
H  -0.632811 0.611746 2.577667
H  0.199367 2.047784 1.939938
H  -1.576512 2.033897 2.031424
H  -3.885436 -0.97493 2.138432
H  -3.171313 0.607676 2.549649
H  -4.847223 0.509563 1.926528
H  1.639078 2.090002 -0.047062
H  2.318906 -2.814937 -0.106471
H  5.344268 -0.854753 -1.003241
H  -7.533344 -0.651855 -0.857257
H  -6.443953 -2.092959 -1.05161
H  -6.366592 -0.755178 -2.247023
H  4.165237 -3.706125 -0.683924
H  5.68537 -3.223819 -1.469775
H  4.120839 -2.772249 -2.211352
H  5.504762 -0.821826 1.457203
H  6.379499 -2.233229 0.798332
H  4.773025 -2.460233 1.562033
H  3.155952 3.047565 -1.557468
H  4.800286 3.501298 -0.973207
H  3.415452 3.474319 0.15712
