program: Gaussian 09
title: 000220291
version: EM64L-G09RevD.01
frameworkgroup: C1[X(C18H22O2)]
method: RPBEPBE
basis: SDD
operation: Freq
keyword: #pfreq=noraman
keyword: PBEPBE/SDD
title: #p freq=noraman PBEPBE/SDD
converged: YES YES NO NO
title: Mulliken charges:
elementType: O O C C C C C C C C C C C C C C C C C C H H H H H H H H H H H H H H H H H H H H H H
charge: -0.436679 -0.436679 0.402366 0.402365 0.352560 0.352559 -0.515738 -0.515738 -0.590782 -0.590781 -0.370351 -0.370351 0.112458 0.112457 -0.395483 -0.395484 -0.407189 -0.407189 -0.692054 -0.692054 0.216940 0.198500 0.216940 0.198501 0.246502 0.246502 0.203142 0.232880 0.203142 0.232879 0.236962 0.236962 0.213228 0.213228 0.213183 0.207372 0.218152 0.213183 0.207372 0.218153 0.354034 0.354034
chargesum: 0.00000
title: Mulliken charges with hydrogens summed into heavy atoms:
elementType: O O C C C C C C C C C C C C C C C C C C
charge: -0.082645 -0.082645 0.402366 0.402365 0.352560 0.352559 -0.100298 -0.100297 -0.344281 -0.344279 0.065670 0.065670 0.112458 0.112457 -0.158522 -0.158522 -0.193961 -0.193961 -0.053347 -0.053346
polarizability: 3.16425210e+02 2.99125196e-05 2.20299577e+02 3.03659562e-01 5.50475373e-05 1.16790319e+02
1716.lowfreq: -6.7178 -4.8693 -4.1953 -0.0007 -0.0006 0.0006 26.2598 28.4308 36.2627
frequency: 26.1849 28.3917 36.1551 60.6670 82.4506 88.1291 95.4099 98.0100 111.9898 150.5608 202.8298 230.1890 232.8888 244.4836 260.4144 274.6049 280.3574 283.6637 313.8526 326.6837 353.7791 355.8295 362.4101 392.2087 446.5301 456.5476 465.9120 483.8724 548.6225 574.5921 583.3862 611.3613 656.7965 669.1637 732.3951 735.4258 742.1567 745.0920 762.9407 764.1332 796.4093 808.1194 843.0613 869.4434 871.0003 876.1657 889.0097 906.0589 919.5327 926.0518 927.0722 940.8502 1032.9185 1049.2913 1051.5641 1068.5251 1085.5772 1093.9382 1094.0978 1099.4726 1103.5676 1164.2747 1171.4618 1190.2069 1210.0912 1226.5325 1227.4060 1241.1556 1245.3527 1280.3190 1280.3300 1287.3643 1288.5912 1301.8196 1307.3005 1309.0945 1339.3753 1340.4470 1369.4049 1384.4417 1387.1599 1387.1832 1422.8717 1423.1978 1464.1631 1464.3319 1475.0879 1475.1687 1477.2189 1477.2458 1486.6930 1486.7400 1491.6920 1513.1079 1595.2287 1603.6067 1614.1053 1617.7441 2970.6588 2970.7426 2979.5561 2979.7028 2988.3867 2988.4913 3028.3936 3028.4097 3049.4602 3049.5297 3070.6597 3070.6770 3073.8921 3074.1056 3107.0437 3107.9176 3123.0778 3128.3472 3145.2759 3149.6659 3579.9779 3580.2813
redmass: 3.5906 3.8042 3.1312 5.1789 1.7703 1.9227 3.7780 3.2068 3.4790 5.4875 4.6287 1.3638 1.1431 2.8862 2.8980 3.6617 2.7865 2.9486 3.7448 3.4651 1.1074 1.2293 4.1534 5.4532 3.3627 3.2556 3.1264 3.9178 6.0382 3.7104 3.9616 5.6589 4.6469 5.0267 3.2003 2.4822 1.4274 1.5817 2.7485 2.8327 1.4325 1.5179 3.7340 1.2963 1.3048 2.0593 2.0839 1.5285 1.6020 1.3460 1.3949 2.9537 2.0649 2.7819 3.0611 2.0306 1.8668 1.9743 2.0038 1.6902 1.7042 1.1632 1.2281 1.6862 2.1059 1.3876 1.3579 2.5304 2.3142 1.2964 1.2955 1.3005 1.2537 1.8036 1.2235 1.6991 1.4532 1.4427 4.1641 7.0064 1.2215 1.2133 3.2574 4.9754 1.1173 1.1442 1.0569 1.0566 1.0467 1.0468 1.0813 1.0870 2.6264 3.1048 6.1794 6.9466 6.3868 6.8035 1.0355 1.0355 1.0590 1.0590 1.0621 1.0621 1.0978 1.0978 1.1023 1.1023 1.0991 1.0991 1.1022 1.1022 1.0884 1.0888 1.0910 1.0903 1.0951 1.0942 1.0659 1.0660
irintensity: 0.0790 0.0464 0.7439 0.5034 0.1183 0.0529 0.0057 2.9849 0.0797 0.0402 0.6596 0.0213 0.2804 0.0303 0.9342 2.3317 7.9531 0.2890 0.1627 19.7941 16.1676 213.5575 13.0470 0.1049 2.8745 18.8076 0.4515 1.7418 35.9681 12.4657 0.2453 0.2886 1.9294 1.1418 2.7367 0.0360 4.3404 2.8567 28.6069 1.1529 87.7600 7.9390 18.1817 3.3095 4.6308 4.4507 18.5046 4.5247 1.2573 3.1820 0.1590 0.2902 8.3006 0.3679 0.9321 8.8874 66.9481 25.3416 19.0175 346.1456 0.2891 48.5750 9.7303 0.1986 33.1809 1.8531 0.0896 131.1186 0.1006 21.0655 0.5623 0.0001 5.4306 2.3456 40.3572 5.3507 0.0466 0.7121 9.5193 21.7323 5.2654 12.4690 78.4425 0.1833 1.5159 3.3484 2.0079 4.8050 3.8430 19.9252 0.0220 31.9192 162.3662 0.0802 1.1535 2.0683 3.0602 18.0217 33.1426 58.4425 5.7341 15.4342 10.0495 95.2819 4.6130 0.2656 1.3692 1.0969 8.7421 97.7013 93.8999 45.0612 43.3685 13.7747 6.8845 14.3976 3.5348 18.0889 84.2705 6.0357
temp: 298.150 k
press: 1.00000 atm
elementType: 8 8 6 6 6 6 6 6 6 6 6 6 6 6 6 6 6 6 6 6 1 1 1 1 1 1 1 1 1 1 1 1 1 1 1 1 1 1 1 1 1 1
symmnumber: 1
zpe: 923484.6 jmol-1
zpe.correction: 0.351737 hartree
zpe.thermalcorrener: 0.372254 hartree
zpe.thermalcorrenthalpy: 0.373198 hartree
zpe.thermalcorrgfe: 0.301304 hartree
zpe.sumelectzpe: -848.094095 hartree
zpe.sumelectthermal: -848.073578 hartree
zpe.sumelectthermalent: -848.072634 hartree
zpe.sumelectthermalfe: -848.144528 hartree
dipole: 0.0000 -2.4499 0.0000
dipole: 2.4499
quadrupole: -108.5644 -103.4091 -125.1768
quadrupole: 0.0000 4.6120 0.0000
quadrupole: 3.8191 8.9743 -12.7933 0.0000 4.6120 0.0000
hfenergy: -848.4458318 hartree
pointgroup: C01 [X(C18H22O2)]
dipole: 0.0000005 0.963861 0.0000114 debye
polarizability: 316.3440099|0.0001789|220.2995774|-4.0368327|0.0008469|116.8715195 unknown
InChI: InChI=1S/C18H22O2/c1-3-5-15-11-13(7-9-17(15)19)14-8-10-18(20)16(12-14)6-4-2/h7-12,19-20H,3-6H2,1-2H3
charge 0 multiplicity 1
42 atoms
O  5.000524 0.947777 -0.048588
O  -5.000542 0.947757 0.048612
C  2.899441 -0.18425 0.314095
C  -2.899454 -0.184255 -0.314097
C  0.744744 1.025092 -0.010295
C  -0.744761 1.025089 0.010311
C  3.663708 -1.448464 0.663223
C  -3.663717 -1.448467 -0.663245
C  1.488074 -0.140868 0.326612
C  -1.488088 -0.140867 -0.326616
C  4.20445 -2.195017 -0.589434
C  -4.204434 -2.195053 0.589403
C  3.589396 1.005244 -0.047236
C  -3.589414 1.005229 0.047257
C  1.475298 2.189955 -0.365434
C  -1.475319 2.189944 0.365471
C  2.884546 2.183235 -0.382221
C  -2.884568 2.183218 0.382261
C  4.984294 -3.472477 -0.21404
C  -4.984274 -3.472511 0.213992
H  4.525077 -1.198065 1.3119
H  3.006215 -2.132537 1.234454
H  -4.525098 -1.198059 -1.311902
H  -3.006228 -2.132521 -1.234502
H  0.950861 -1.043605 0.642085
H  -0.950872 -1.043596 -0.642106
H  3.355654 -2.451673 -1.25374
H  4.859603 -1.507091 -1.155756
H  -3.355625 -2.451718 1.25369
H  -4.859582 -1.507146 1.155752
H  0.942045 3.099405 -0.662705
H  -0.94207 3.09939 0.662757
H  3.431682 3.091692 -0.668279
H  -3.431707 3.091668 0.668336
H  5.855026 -3.230875 0.424363
H  4.3448 -4.182499 0.344459
H  5.359677 -3.992751 -1.11443
H  -5.855017 -3.230901 -0.424392
H  -4.344783 -4.182515 -0.344532
H  -5.35964 -3.992807 1.114375
H  5.383116 1.83151 -0.274625
H  -5.383136 1.831483 0.274667
