program: Gaussian 09
title: 000220284
version: EM64L-G09RevD.01
frameworkgroup: C1[X(C14H14O4)]
method: RPBEPBE
basis: SDD
operation: Freq
keyword: #pfreq=noraman
keyword: PBEPBE/SDD
title: #p freq=noraman PBEPBE/SDD
converged: YES YES NO NO
title: Mulliken charges:
elementType: O O O O C C C C C C C C C C C C C C H H H H H H H H H H H H H H
charge: -0.411639 -0.411639 -0.427206 -0.427206 0.194837 0.194839 0.072635 0.072635 -0.550664 -0.550667 0.367029 0.367031 0.121833 0.121831 -0.532711 -0.532711 -0.856824 -0.856824 0.303812 0.303812 0.255565 0.255564 0.254292 0.233412 0.234810 0.234811 0.254292 0.233412 0.374591 0.374591 0.366229 0.366229
chargesum: 0.00000
title: Mulliken charges with hydrogens summed into heavy atoms:
elementType: O O O O C C C C C C C C C C C C C C
charge: -0.037048 -0.037048 -0.060976 -0.060977 0.194837 0.194839 0.072635 0.072635 -0.246852 -0.246855 0.367029 0.367031 0.121833 0.121831 -0.277146 -0.277146 -0.134311 -0.134311
polarizability: 2.74957193e+02 6.39883604e-01 1.55749343e+02 5.89529732e-05 -1.62173932e-05 1.00245956e+02
1716.lowfreq: -5.6168 -0.0007 -0.0003 0.0006 1.9874 4.3036 44.0167 49.8011 65.5547
frequency: 44.0143 49.8010 65.5506 119.0252 133.0884 144.7767 146.5475 186.4108 200.1573 211.3307 264.7436 267.4518 281.1299 281.2337 282.3579 290.0116 334.9555 348.2351 377.4093 404.0611 440.2059 444.1937 458.5736 465.0172 481.2948 502.4573 528.2863 562.1737 576.6900 622.6408 639.3353 654.0338 711.3633 716.2519 729.0635 735.2920 762.9770 811.7568 876.9171 878.8528 902.2238 902.6874 943.1882 988.0060 988.4793 1042.1851 1042.2231 1092.9611 1128.9135 1137.4396 1145.1916 1170.2348 1175.8716 1178.2255 1201.4820 1243.5577 1249.4401 1268.0022 1312.6360 1356.1647 1363.5904 1378.0382 1395.6147 1396.2386 1436.3875 1455.3954 1475.4481 1476.7249 1476.9469 1487.1881 1489.3676 1509.4696 1568.1658 1579.1028 1648.1828 1648.2143 2956.7487 2956.9208 3025.7548 3025.7594 3091.4601 3091.4623 3151.9059 3151.9200 3157.3483 3157.4847 3482.9801 3486.8662 3586.3328 3586.4168
redmass: 6.4457 4.2640 4.5322 4.8677 4.8761 1.1175 1.1187 3.6144 3.0966 7.0878 1.1720 1.4301 3.2333 2.9068 3.0134 4.9953 5.0996 4.8336 5.3392 4.4581 6.0891 2.8411 2.0684 9.1280 1.6031 1.1624 3.7952 4.0945 3.7332 4.7501 5.0909 5.2128 6.5652 5.0518 4.6987 4.4033 5.1842 4.1666 1.4067 1.4223 1.3100 1.3840 3.9030 1.5312 1.4928 1.5041 1.5043 6.4405 1.8914 1.4038 1.5757 1.4394 2.6191 2.3019 1.5966 2.2068 1.4749 1.4157 2.7327 4.0023 5.9917 6.2003 1.2392 1.2262 2.9194 1.8331 1.2578 1.0447 1.0772 2.8464 1.6141 4.4407 6.1318 7.0112 7.0252 6.8429 1.0400 1.0400 1.0978 1.0978 1.0948 1.0948 1.0917 1.0915 1.0922 1.0922 1.0651 1.0653 1.0656 1.0656
irintensity: 0.6365 0.5136 0.9774 0.3275 0.0376 0.0447 0.0350 0.9364 8.1042 0.6415 44.9718 121.7853 12.0303 2.2057 47.6883 5.1494 33.0078 3.7289 32.6090 2.4755 1.2517 37.6459 8.0235 0.0477 16.2252 144.8616 4.3736 8.9037 0.5782 0.5083 0.0276 2.9181 30.5336 4.0301 1.0205 10.6892 65.2027 32.1363 13.2520 3.4156 23.9582 20.1908 11.6495 65.5518 8.5197 10.5959 3.9417 1.7834 81.6625 68.8080 146.6282 2.4526 191.0263 35.4366 192.8293 68.0685 41.7169 1.2393 6.5837 7.0267 221.0547 10.0458 18.0876 0.1505 12.7769 0.0055 23.1334 22.8090 12.6286 225.4565 12.1998 34.5011 11.0687 0.0177 0.0418 1.0583 83.2243 1.0526 10.0172 33.1590 7.3047 16.1262 0.9121 2.3102 7.9603 1.2551 0.1839 190.3610 73.1788 4.8288
temp: 298.150 k
press: 1.00000 atm
elementType: 8 8 8 8 6 6 6 6 6 6 6 6 6 6 6 6 6 6 1 1 1 1 1 1 1 1 1 1 1 1 1 1
symmnumber: 1
zpe: 647133.2 jmol-1
zpe.correction: 0.246480 hartree
zpe.thermalcorrener: 0.264019 hartree
zpe.thermalcorrenthalpy: 0.264963 hartree
zpe.thermalcorrgfe: 0.202142 hartree
zpe.sumelectzpe: -841.484687 hartree
zpe.sumelectthermal: -841.467148 hartree
zpe.sumelectthermalent: -841.466204 hartree
zpe.sumelectthermalfe: -841.529025 hartree
dipole: 0.0000 0.0000 0.1222
dipole: 0.1222
quadrupole: -61.3401 -116.4400 -111.2656
quadrupole: -1.0623 0.0000 0.0000
quadrupole: 35.0085 -20.0915 -14.9170 -1.0623 0.0000 0.0000
hfenergy: -841.7311671 hartree
pointgroup: C01 [X(C14H14O4)]
dipole: 0.0000003 0.0480617 0.0000109 debye
polarizability: 274.8436746|0.0003689|100.2459588|-3.7321437|-0.0122635|155.8628589 unknown
InChI: InChI=1S/C14H14O4/c1-7-3-13(17)9(5-11(7)15)10-6-12(16)8(2)4-14(10)18/h3-6,15-18H,1-2H3
charge 0 multiplicity 1
32 atoms
O  -0.663322 -1.152585 -2.249525
O  0.663328 -1.153588 2.24901
O  -3.694961 1.139535 1.900483
O  3.694982 1.140351 -1.899981
C  -0.74377 0.016303 -0.060125
C  0.743783 0.016272 0.060129
C  -1.381771 -0.551363 -1.202718
C  1.38178 -0.551904 1.202471
C  -1.566433 0.566581 0.957884
C  1.56645 0.566993 -0.957636
C  -3.608984 -0.008443 -0.301817
C  3.608997 -0.008596 0.301814
C  -2.970064 0.555946 0.839327
C  2.970081 0.556299 -0.839082
C  -2.788899 -0.557419 -1.311551
C  2.788907 -0.558014 1.311303
C  -5.122399 -0.008836 -0.421261
C  5.122411 -0.009051 0.421262
H  -1.121708 1.068609 1.823505
H  1.121729 1.069401 -1.823039
H  -3.234817 -1.009329 -2.203175
H  3.234821 -1.010318 2.20273
H  -5.44071 -0.50287 -1.353357
H  -5.60643 -0.552976 0.414883
H  -5.53818 1.01899 -0.442911
H  5.538199 1.018762 0.443371
H  5.440715 -0.503501 1.35314
H  5.606443 -0.552823 -0.415121
H  0.311307 -1.118103 -2.054039
H  -0.3113 -1.11902 2.053537
H  -4.666803 1.114636 1.718737
H  4.666824 1.115362 -1.718248
