program: Gaussian 09
title: 000220292
version: EM64L-G09RevD.01
frameworkgroup: C1[X(C21H22O2)]
method: RPBEPBE
basis: SDD
operation: Freq
keyword: #pfreq=noraman
keyword: PBEPBE/SDD
title: #p freq=noraman PBEPBE/SDD
converged: YES YES NO NO
title: Mulliken charges:
elementType: O O C C C C C C C C C C C C C C C C C C C C C H H H H H H H H H H H H H H H H H H H H H H
charge: -0.468425 -0.184459 -0.078025 -0.243178 0.216475 0.141993 -0.087172 -0.377932 0.434455 -0.522245 0.305027 -0.710285 -0.394137 -0.425314 -0.691473 -0.383476 -0.387871 -0.234482 -0.227731 -0.247492 -0.245915 -0.240193 -0.242521 0.279690 0.185250 0.237269 0.268039 0.208310 0.347894 0.251915 0.209798 0.213626 0.235977 0.280101 0.239501 0.221436 0.221466 0.229270 0.296080 0.225204 0.225838 0.227537 0.229140 0.229551 0.231486
chargesum: 0.00000
title: Mulliken charges with hydrogens summed into heavy atoms:
elementType: O O C C C C C C C C C C C C C C C C C C C C C
charge: -0.120531 -0.184459 -0.078025 0.036513 0.216475 0.141993 -0.087172 0.044587 0.434455 -0.045897 0.305027 -0.034946 -0.158160 -0.145214 -0.009070 -0.154206 -0.091791 -0.009278 -0.001894 -0.019956 -0.016775 -0.010643 -0.011035
polarizability: 2.36779975e+02 -1.42577049e+01 2.76285816e+02 1.25305015e+01 1.63142742e+01 1.83075347e+02
1716.lowfreq: -8.0821 -0.0009 -0.0007 -0.0005 6.9312 11.1036 29.7682 44.2787 44.6177
frequency: 29.6850 44.2167 44.4679 50.7279 56.1248 69.0419 86.9972 90.5340 134.7907 151.3759 177.3931 200.1723 208.2083 221.2259 238.8680 259.4887 267.2881 291.9421 294.4661 314.1201 327.1927 336.6432 379.8141 385.9750 402.1270 404.1485 431.6320 473.9949 503.6123 515.3927 587.3848 615.6648 616.9857 626.0612 649.8266 663.8478 687.7957 700.8992 707.5184 747.7622 755.5146 773.1709 782.1842 801.8571 829.7254 852.0777 856.7882 860.6946 900.3591 921.2376 931.6692 940.8034 950.9854 982.9761 984.9261 989.7517 990.5160 996.0183 1000.4442 1003.1145 1023.2840 1028.4154 1045.7828 1050.0152 1059.4027 1070.7771 1083.7477 1087.8576 1101.4956 1128.6359 1150.8576 1156.2205 1172.3830 1174.4763 1188.8358 1194.8426 1211.0265 1216.7011 1240.3235 1261.5468 1291.4013 1294.9636 1311.8921 1322.3376 1337.0551 1339.2679 1355.5978 1375.3949 1382.4657 1390.3911 1393.1906 1435.6192 1436.8527 1468.3371 1473.4059 1477.6782 1479.1766 1480.9842 1483.2403 1489.9239 1489.9380 1575.6219 1591.6211 1593.7139 1607.7959 1614.6070 1624.9179 2974.7948 2982.2648 2985.2968 2985.9008 2996.3384 3036.5003 3043.0179 3071.1443 3081.5535 3090.6640 3095.2530 3110.5625 3125.7238 3126.7850 3137.3860 3139.2616 3153.3698 3157.5154 3164.0926 3171.2209 3171.8755 3563.8929
redmass: 4.2893 3.0154 4.1193 4.3908 3.7733 3.2939 3.1439 3.8983 3.0541 4.0447 3.0085 2.0404 1.4809 1.6762 3.0235 4.8514 2.7981 2.9325 3.5643 3.3104 1.6507 2.5959 4.2084 5.2584 2.8572 2.8659 4.1107 3.9098 4.1526 3.9897 4.2114 6.3564 6.4121 6.5162 6.0710 2.6526 4.2491 1.6973 1.7829 1.9705 2.0653 2.3870 2.0485 1.6314 2.5235 2.5252 1.3539 1.2783 3.2642 2.2334 1.4921 1.5298 2.5802 1.3808 1.5046 3.9835 5.5478 2.4288 1.4111 1.3329 2.8095 2.1796 2.4592 3.3255 1.9352 1.9182 1.6718 1.7132 1.8975 2.0260 2.6528 1.8749 1.0567 1.0536 1.1442 1.1341 1.3494 2.2403 1.5014 1.4668 1.4519 2.1721 1.4010 1.3970 1.5477 1.5491 1.9180 6.2958 8.4536 1.2301 1.2141 2.2788 2.2988 1.0695 1.0528 1.0626 1.2549 1.4872 2.2551 1.1458 1.0861 5.8426 7.2317 8.5822 6.2420 6.1252 9.8053 1.0761 1.0370 1.0655 1.0361 1.0600 1.0987 1.1004 1.0996 1.1001 1.1008 1.0987 1.0876 1.0865 1.0849 1.0891 1.0928 1.0936 1.0974 1.0953 1.0969 1.0993 1.0659
irintensity: 0.5664 0.6222 0.0998 0.2013 0.4115 0.8657 0.1900 1.1853 0.1205 0.8847 2.6809 0.8121 0.3305 0.7261 1.4903 2.3479 11.3992 15.5529 8.2933 33.0299 63.1097 25.5489 2.4155 3.2542 0.4676 0.1332 13.6565 12.7858 1.4053 3.2352 4.8758 0.1330 0.1163 7.1597 11.3792 6.3467 1.8213 59.6377 46.7482 45.3659 35.3347 6.0875 27.0481 4.9857 15.0544 5.9531 1.5131 0.9280 36.9698 15.8118 5.3037 14.8670 9.5402 0.8630 0.9348 0.6116 0.1320 4.6037 1.6197 1.3442 10.8925 7.5649 1.5024 11.2617 5.7179 10.3416 13.7503 14.8579 16.6912 4.4776 39.4322 30.9632 0.4514 0.1742 1.7042 1.7728 8.3564 46.3767 13.6231 7.6298 22.1368 83.0462 0.3554 3.3917 20.7780 19.3122 36.0691 9.4711 2.4251 11.8167 10.0753 23.9003 3.3277 6.3238 11.7962 18.8481 7.8454 3.4717 13.5507 13.7399 28.3534 33.4895 75.9048 167.9893 6.4975 3.9884 65.7911 2.5754 37.8032 17.9450 43.4234 21.8481 12.8175 3.8254 50.0867 37.3502 30.3383 31.2863 9.5398 1.3250 0.2039 10.6994 27.2059 24.2968 27.5706 13.7542 8.9831 20.9681 6.6123
temp: 298.150 k
press: 1.00000 atm
elementType: 8 8 6 6 6 6 6 6 6 6 6 6 6 6 6 6 6 6 6 6 6 6 6 1 1 1 1 1 1 1 1 1 1 1 1 1 1 1 1 1 1 1 1 1 1
symmnumber: 1
zpe: 970342.9 jmol-1
zpe.correction: 0.369584 hartree
zpe.thermalcorrener: 0.391239 hartree
zpe.thermalcorrenthalpy: 0.392183 hartree
zpe.thermalcorrgfe: 0.318478 hartree
zpe.sumelectzpe: -962.224126 hartree
zpe.sumelectthermal: -962.202471 hartree
zpe.sumelectthermalent: -962.201526 hartree
zpe.sumelectthermalfe: -962.275232 hartree
dipole: 1.6786 -2.6321 -0.4579
dipole: 3.1552
quadrupole: -128.4766 -143.5616 -129.3107
quadrupole: 2.0817 3.4457 -5.1080
quadrupole: 5.3063 -9.7786 4.4723 2.0817 3.4457 -5.1080
hfenergy: -962.5937098 hartree
pointgroup: C01 [X(C21H22O2)]
dipole: -0.5213624 1.1099734 -0.1926918 debye
polarizability: 228.4337503|-11.3818453|277.098979|-20.3693052|-19.7711376|190.6084089 unknown
InChI: InChI=1S/C21H22O2/c1-3-17-19(15-11-7-5-8-12-15)21(23,18(4-2)20(17)22)16-13-9-6-10-14-16/h5-14,18,23H,3-4H2,1-2H3
charge 0 multiplicity 1
45 atoms
O  0.547975 -0.701071 -1.951421
O  0.116556 -3.852076 1.170122
C  0.673197 -0.612366 -0.473197
C  1.301066 -1.922063 0.134325
C  -0.760835 -0.563082 0.138154
C  -1.083142 -1.757623 0.758826
C  0.098544 -2.663586 0.7405
C  2.151587 -2.816477 -0.796255
C  1.509466 0.636443 -0.179614
C  -2.390587 -2.267693 1.3261
C  -1.608791 0.64061 -0.014876
C  3.51355 -2.203628 -1.17938
C  1.624955 1.091247 1.158457
C  2.194182 1.332391 -1.20286
C  -3.520762 -2.366186 0.267114
C  -2.518128 1.028125 1.011827
C  -1.509581 1.467121 -1.172464
C  2.414329 2.2187 1.469094
C  2.98569 2.46142 -0.892573
C  3.101297 2.908919 0.442839
C  -3.305222 2.18998 0.8845
C  -2.307806 2.62178 -1.303227
C  -3.20982 2.990466 -0.278154
H  1.947198 -1.620829 0.984377
H  1.583758 -3.061882 -1.715732
H  2.298674 -3.775374 -0.263051
H  -2.188793 -3.273477 1.739718
H  -2.733677 -1.643337 2.171488
H  0.032859 -1.519313 -2.167546
H  3.387184 -1.278761 -1.766858
H  4.10327 -1.953359 -0.277436
H  4.105224 -2.915104 -1.784164
H  1.085872 0.570138 1.960337
H  2.097771 0.985893 -2.235551
H  -3.763163 -1.378662 -0.16251
H  -3.223258 -3.038239 -0.557861
H  -4.439109 -2.777205 0.723956
H  -2.584877 0.434611 1.928568
H  -0.815661 1.180403 -1.967642
H  2.49085 2.561089 2.507285
H  3.511396 2.991313 -1.695179
H  3.714598 3.784979 0.681928
H  -3.988045 2.474906 1.692685
H  -2.222864 3.237673 -2.205395
H  -3.824725 3.89169 -0.379657
