program: Gaussian 09
title: 000220279
version: EM64L-G09RevD.01
frameworkgroup: C1[X(C10H7Cl5O3)]
method: RPBEPBE
basis: SDD
operation: Freq
keyword: #p
keyword: freq=noraman
keyword: PBEPBE/SDD
title: #p freq=noraman PBEPBE/SDD
converged: YES YES NO NO
title: Mulliken charges:
elementType: Cl Cl Cl Cl Cl O O O C C C C C C C C C C H H H H H H H
charge: 0.059634 0.063969 0.062594 0.062360 0.068422 -0.234493 -0.261175 -0.233728 0.021186 -0.677346 -0.675671 0.717223 -0.303981 -0.317714 -0.078488 -0.082764 -0.117047 0.304319 0.238294 0.212382 0.238856 0.230900 0.219486 0.254054 0.228728
chargesum: 0.00000
title: Mulliken charges with hydrogens summed into heavy atoms:
elementType: Cl Cl Cl Cl Cl O O O C C C C C C C C C C
charge: 0.059634 0.063969 0.062594 0.062360 0.068422 -0.234493 -0.261175 -0.233728 0.259481 0.004790 0.026598 0.717223 -0.303981 -0.317714 -0.078488 -0.082764 -0.117047 0.304319
polarizability: 2.33140647e+02 2.37517115e-01 1.95110047e+02 1.39891971e+01 5.06795545e-04 8.81670435e+01
1716.lowfreq: -3.5687 -1.9792 -0.0010 0.0017 0.0018 6.4451 13.7844 31.1981 36.1675
frequency: 13.4000 31.1483 36.1559 63.9757 69.1072 76.2857 92.0693 102.7378 148.6829 173.7043 193.6490 198.9809 200.4886 212.1261 213.5285 238.9623 252.3297 291.1046 315.5591 317.8597 325.0833 347.2219 360.9856 365.5309 389.5720 448.4047 528.9990 581.4252 591.9995 611.8757 659.2014 678.8925 683.6704 709.7236 768.2504 802.1718 824.9311 860.6870 898.1265 930.4952 943.1737 975.9949 1063.4541 1098.5365 1143.9466 1160.2198 1190.3491 1233.9265 1327.6300 1329.1852 1334.4496 1337.7747 1363.6132 1385.7074 1402.3957 1456.6807 1465.4808 1473.1313 1487.7822 1536.3049 1545.3366 1659.0049 2994.1037 2999.1153 3030.8354 3090.4565 3099.4971 3104.1543 3109.5458
redmass: 6.9885 4.3104 6.8112 7.4304 10.9993 20.5486 5.7362 10.2387 5.2227 10.8490 1.0277 28.9171 30.6809 8.3545 34.0968 1.3646 3.4215 18.5312 20.6192 13.1338 12.1892 7.4182 18.1466 4.8019 3.4402 2.7521 6.7568 11.8858 12.0868 13.1243 14.0140 12.5922 10.4549 9.8897 7.5968 7.0061 12.9528 7.0101 3.3049 1.2247 1.3521 9.3523 6.6081 2.1203 5.0899 2.0667 1.9896 12.3208 1.3758 7.0230 1.5015 12.0030 11.5759 1.2583 1.2261 1.0516 1.0474 1.0505 1.0491 11.9933 11.9935 11.8934 1.0357 1.0361 1.0872 1.0990 1.0992 1.1012 1.1008
irintensity: 0.3298 0.3547 0.3527 0.7164 0.5188 0.2399 0.1330 0.6227 1.0048 1.0379 0.0226 0.0774 0.0779 0.8345 0.0074 1.1133 13.3535 0.1342 0.0983 0.0182 0.2257 0.1137 1.0152 1.5397 14.8485 1.7288 1.3199 0.2694 0.0367 10.2130 42.5812 28.6619 11.4223 79.4638 8.2963 16.3867 0.0930 37.7072 37.8024 2.7793 0.2088 71.3470 360.0824 182.6741 835.0360 81.8648 44.0472 13.0916 19.6905 113.7778 2.8628 37.6258 186.9646 36.4170 22.3310 6.7166 4.5472 6.6789 23.8075 0.5231 2.4301 223.1158 10.5127 16.3194 6.8912 8.6785 35.6524 12.7680 31.7850
temp: 298.150 k
press: 1.00000 atm
elementType: 17 17 17 17 17 8 8 8 6 6 6 6 6 6 6 6 6 6 1 1 1 1 1 1 1
symmnumber: 1
zpe: 394473.9 jmol-1
zpe.correction: 0.150247 hartree
zpe.thermalcorrener: 0.169750 hartree
zpe.thermalcorrenthalpy: 0.170694 hartree
zpe.thermalcorrgfe: 0.098737 hartree
zpe.sumelectzpe: -2909.875302 hartree
zpe.sumelectthermal: -2909.855799 hartree
zpe.sumelectthermalent: -2909.854854 hartree
zpe.sumelectthermalfe: -2909.926812 hartree
dipole: -3.2718 -0.1031 0.2467
dipole: 3.2827
quadrupole: -114.3273 -136.9205 -142.7196
quadrupole: 0.1886 -4.2674 0.5126
quadrupole: 16.9952 -5.5980 -11.3971 0.1886 -4.2674 0.5126
hfenergy: -2910.0255489 hartree
pointgroup: C01 [X(C10H7Cl5O3)]
dipole: -1.2840222 0.092751 -0.103578 debye
dipolederiv: -0.2274452 0.2868681 0.0627485 0.2918205 -0.4415619 -0.0831021 0.0504917 -0.072553 0.0013621 -0.1822635 -0.2757179 0.0306914 -0.2758768 -0.4850475 0.0420659 0.0219626 0.0297809 0.0140334 -0.1957783 0.2848382 0.0351192 0.3106731 -0.4765259 -0.0611826 0.0534067 -0.0727262 0.0088218 -0.162462 -0.2622675 0.0096319 -0.2952305 -0.5109255 0.0191849 0.0240583 0.0314431 0.0170929 -0.6682709 -0.0193374 0.1091924 -0.0237542 -0.0016248 0.0028978 0.1326398 0.0038452 -0.0015435 -2.1665573 0.0876305 0.0052067 -0.0121978 -0.3061275 0.0589988 0.1074052 0.0450128 -0.4271207 -2.1062647 0.0636655 -0.3383169 0.0848157 -0.239481 0.0330009 -0.5753878 0.0464951 -0.5406482 -0.8489927 0.0148823 0.0635244 0.0294195 -0.265045 0.0572047 -0.079258 0.0449018 -0.8721069 1.2307628 -0.0452704 0.0914074 -0.0632373 0.4170709 -0.0664236 0.467041 -0.0581945 0.3005865 -0.1455308 -0.0414799 0.0403279 -0.0632477 -0.021987 0.0549851 0.004389 0.0642994 0.0270115 -0.1260211 -0.0136427 0.0093493 0.0190925 -0.167078 0.0900047 -0.1011433 0.062105 0.025213 1.20693 -0.0172152 0.0924605 0.0452886 -0.0979204 -0.0005662 -0.239581 0.0027706 0.0767079 0.1449757 -0.4578444 -0.1215578 -0.5810591 0.5175702 0.1441337 -0.0546973 0.0973709 -0.0180771 0.0756843 0.4634971 -0.0727167 0.5508858 0.6038391 -0.0899358 -0.014172 -0.0499292 -0.0397672 0.0403247 -0.5224322 -0.0212227 -0.5782376 0.6043402 0.1203613 -0.0346441 0.1227058 0.0006508 -0.0209425 0.4766143 0.0262169 0.5441211 0.6766716 -0.0665912 0.022756 -0.0680487 -0.01561 0.9207247 0.0383272 -0.1682644 0.0397316 -0.2640642 -0.0165087 -0.1905021 -0.0174037 -0.0035383 3.1130935 -0.1075292 0.1652681 -0.0957453 0.2988753 -0.1185888 0.4440127 -0.0801592 1.427549 -0.0343442 0.0454292 0.0565461 0.0336507 -0.0163369 -0.0541502 -0.051321 -0.0568969 -0.0533761 -0.1012057 -0.0025233 -0.0864983 0.0137449 0.1096866 0.0231621 -0.1118471 0.010678 0.0110284 0.1112005 0.0543063 -0.0000741 0.0261478 -0.1158791 0.0531666 0.0294414 0.0511841 0.0860485 0.104508 -0.0080124 0.0165643 0.0185716 0.0293743 -0.1172933 0.0723565 -0.0711459 -0.0548186 -0.0858556 0.0334786 -0.1204461 0.0463375 0.0869064 -0.0040517 -0.1337689 0.0118664 0.0379966 -0.000915 -0.0894966 0.090957 -0.0788522 0.0397968 0.0271892 0.103648 0.0279891 0.0620488 0.1246454 0.0132316 0.0238852 0.0131376 0.0254732 -0.0479615 0.0527141 -0.105391 -0.0695446 unknown
polarizability: 233.2201331|-1.6114317|195.1656178|-13.1485204|1.671423|88.0319869 unknown
InChI: InChI=1S/C10H7Cl5O3/c1-3(2)17-10(16)18-9-7(14)5(12)4(11)6(13)8(9)15/h3H,1-2H3
charge 0 multiplicity 1
25 atoms
Cl 0.140113 2.668282 0.667969
Cl 0.291189 -2.833891 0.417984
Cl 3.472068 -2.748404 -0.198797
Cl 3.314404 2.815003 0.034727
Cl 4.972568 0.090354 -0.390634
O  -3.091369 -0.086432 0.409875
O  -0.916018 -0.135744 0.874112
O  -1.579565 0.114951 -1.383798
C  -4.288379 0.056089 -0.52315
C  -5.440616 -0.605488 0.23047
C  -4.49604 1.543693 -0.828298
C  0.440778 -0.075585 0.503598
C  1.099016 1.171153 0.417967
C  1.167458 -1.271288 0.312453
C  2.552697 -1.224392 0.039513
C  2.483059 1.226687 0.142475
C  3.210917 0.026421 -0.044973
C  -1.868335 -0.015331 -0.180987
H  -4.032718 -0.496919 -1.446338
H  -6.355402 -0.572183 -0.387942
H  -5.209824 -1.6595 0.458426
H  -5.640284 -0.077405 1.178778
H  -5.381058 1.66637 -1.478738
H  -3.624565 1.967165 -1.355238
H  -4.668096 2.111091 0.102846
