program: Gaussian 09
title: 000220271
version: EM64L-G09RevD.01
frameworkgroup: C1[X(C8H17NO2)]
method: RPBEPBE
basis: SDD
operation: Freq
keyword: #p
keyword: freq=noraman
keyword: PBEPBE/SDD
title: #p freq=noraman PBEPBE/SDD
converged: YES YES NO NO
title: Mulliken charges:
elementType: O O N C C C C C C C C H H H H H H H H H H H H H H H H H
charge: -0.460342 -0.295854 -0.349246 -0.025703 -0.375802 -0.398331 -0.714244 -0.707766 0.179682 -0.137110 -0.661759 0.204896 0.222264 0.182758 0.231657 0.268137 0.211670 0.210774 0.218973 0.220916 0.213105 0.213694 0.297028 0.215263 0.249832 0.233526 0.185346 0.366638
chargesum: 0.00000
title: Mulliken charges with hydrogens summed into heavy atoms:
elementType: O O N C C C C C C C C
charge: -0.093705 -0.295854 -0.052217 0.179193 0.029219 0.101463 -0.072827 -0.060051 0.179682 0.078153 0.006945
polarizability: 1.24751303e+02 3.21623403e+00 9.88851963e+01 1.54845955e+00 -3.89052611e+00 7.98689303e+01
1716.lowfreq: -5.6889 0.0011 0.0012 0.0014 6.8193 15.4705 27.4660 33.4088 44.6486
frequency: 26.0793 32.9048 44.5286 60.8291 99.2539 171.2552 187.2882 211.7874 218.2112 234.1849 260.6152 332.4712 343.0275 362.4617 371.5447 392.9770 454.3323 491.4776 558.2127 582.9549 631.1541 710.7688 760.9956 790.3330 836.8381 897.9914 916.2134 953.9501 961.6335 978.1647 998.4987 1020.1642 1044.9324 1079.7892 1120.5328 1130.4521 1151.6090 1192.5355 1213.7610 1228.7735 1248.8247 1284.3628 1297.2293 1314.9550 1335.4314 1340.0739 1371.4591 1380.7256 1382.7104 1386.6099 1400.5081 1454.8130 1458.8515 1465.1936 1473.6981 1476.9579 1479.7550 1485.5573 1491.8471 1512.1805 1612.5836 2954.9930 2970.1169 2971.0565 2972.0733 2976.9719 2983.6421 2999.0394 3027.4678 3063.4043 3067.0655 3072.6206 3073.6238 3081.7160 3088.3472 3104.8430 3377.2353 3539.4455
redmass: 3.1265 3.6759 5.2069 4.2269 1.9934 3.4961 2.7991 1.1323 1.1226 1.0379 2.5658 2.8945 4.0397 2.4202 3.2236 2.8357 2.1193 1.3077 1.6042 1.6909 4.3549 3.2664 1.3371 2.9320 2.7110 2.3109 1.2251 1.3789 2.0146 2.1532 1.8161 1.9022 3.1773 2.8085 2.0379 1.9064 1.9681 1.9298 1.3457 1.2840 1.8229 1.5873 1.1273 1.2441 1.4294 1.3146 1.3577 1.2746 1.2674 1.2204 1.2162 1.0717 1.0732 1.0457 1.0619 1.0924 1.0653 1.0515 1.0541 1.8622 6.4820 1.0683 1.0493 1.0795 1.0600 1.0422 1.0384 1.0670 1.0955 1.0997 1.0995 1.0986 1.0994 1.0977 1.0987 1.1010 1.0642 1.0772
irintensity: 2.7964 1.5693 0.3510 0.2192 0.2231 0.6067 0.1943 0.0547 0.0604 0.1162 0.2574 4.3899 34.7709 8.4739 4.8338 13.0238 49.1872 58.2701 87.5909 44.9205 9.5001 5.3974 2.0478 3.6552 11.2837 1.8335 2.5871 0.8295 0.8052 0.8457 3.0517 57.7283 24.0126 37.5314 41.9470 5.3485 9.2993 9.7070 5.3361 2.9100 124.1519 52.0318 16.3201 2.2355 2.5293 0.2022 7.4470 132.9592 36.1063 22.2617 13.1755 19.0089 3.7073 1.7005 7.3657 12.9543 6.1830 14.3902 14.0792 131.7638 155.2653 19.5732 30.6348 30.1533 75.8696 4.6833 24.6510 29.8743 34.5517 24.9925 14.0685 102.8625 54.3971 38.0151 7.4932 22.1475 66.0266 15.7811
temp: 298.150 k
press: 1.00000 atm
elementType: 8 8 7 6 6 6 6 6 6 6 6 1 1 1 1 1 1 1 1 1 1 1 1 1 1 1 1 1
symmnumber: 1
zpe: 640202.4 jmol-1
zpe.correction: 0.243840 hartree
zpe.thermalcorrener: 0.257791 hartree
zpe.thermalcorrenthalpy: 0.258735 hartree
zpe.thermalcorrgfe: 0.201658 hartree
zpe.sumelectzpe: -519.346027 hartree
zpe.sumelectthermal: -519.332077 hartree
zpe.sumelectthermalent: -519.331133 hartree
zpe.sumelectthermalfe: -519.388209 hartree
dipole: -3.5862 -3.8634 0.6174
dipole: 5.3074
quadrupole: -78.8642 -69.1216 -69.4529
quadrupole: -7.4776 -2.0807 -0.7166
quadrupole: -6.3847 3.3579 3.0267 -7.4776 -2.0807 -0.7166
hfenergy: -519.5898677 hartree
pointgroup: C01 [X(C8H17N1O2)]
dipole: -1.4123134 1.4961065 -0.3565081 debye
polarizability: 124.7538698|-3.3098968|98.1812387|-1.3328426|-5.2843057|80.5703213 unknown
InChI: InChI=1S/C8H17NO2/c1-6(2)4-5-9-8(11)7(3)10/h6-7,9-10H,4-5H2,1-3H3
charge 0 multiplicity 1
28 atoms
O  3.832778 -0.945442 -0.325963
O  1.413785 -1.336733 0.697835
N  0.51316 0.659951 -0.109935
C  -3.318829 -0.047291 -0.456234
C  -1.838601 0.215439 -0.857041
C  -0.870522 0.399415 0.335236
C  -3.954225 1.155503 0.284832
C  -3.481249 -1.354138 0.358376
C  1.54668 -0.220459 0.095697
C  2.942508 0.200384 -0.432204
C  3.519179 1.397096 0.358019
H  -3.873931 -0.178832 -1.409032
H  -1.471367 -0.629986 -1.471542
H  -1.80075 1.120813 -1.499519
H  -1.202383 1.232769 0.98338
H  -0.825594 -0.514723 0.94957
H  -3.498776 1.306992 1.281534
H  -3.835778 2.092864 -0.291333
H  -5.036136 0.989561 0.441324
H  -3.009154 -2.210689 -0.15781
H  -4.550845 -1.592423 0.505535
H  -3.021515 -1.269165 1.360787
H  0.698964 1.521884 -0.627057
H  2.856854 0.467717 -1.505785
H  4.554719 1.576051 0.023147
H  3.539899 1.171155 1.438384
H  2.934526 2.323245 0.198598
H  3.332305 -1.632158 0.206399
