program: Gaussian 09
title: 000220274
version: EM64L-G09RevD.01
frameworkgroup: C1[X(C21H17N3O)]
method: RPBEPBE
basis: SDD
operation: Freq
keyword: #p
keyword: freq=noraman
keyword: PBEPBE/SDD
title: #p freq=noraman PBEPBE/SDD
converged: YES YES NO NO
title: Mulliken charges:
elementType: O N N N C C C C C C C C C C C C C C C C C C C C C H H H H H H H H H H H H H H H H H
charge: -0.235080 -0.348403 -0.048407 -0.692991 0.466351 0.103342 0.161377 0.115596 0.048548 0.359978 -0.370212 -0.351163 -0.395518 -0.395483 0.358862 -0.323154 -0.768818 -0.351500 -0.245532 -0.378630 -0.377046 -0.206409 -0.433324 -0.432982 0.500515 0.247680 0.246004 0.238080 0.236083 0.270751 0.250734 0.249791 0.264539 0.259191 0.230598 0.233535 0.232029 0.231608 0.216843 0.217502 0.307756 0.307361
chargesum: 0.00000
title: Mulliken charges with hydrogens summed into heavy atoms:
elementType: O N N N C C C C C C C C C C C C C C C C C C C C C
charge: -0.235080 -0.348403 -0.048407 -0.077875 0.466351 0.103342 0.161377 0.115596 0.048548 0.359978 -0.122532 -0.105159 -0.157439 -0.159400 0.358862 -0.052403 -0.003754 -0.092309 -0.013503 -0.148033 -0.143511 0.025199 -0.216481 -0.215480 0.500515
polarizability: 4.95960579e+02 1.59823332e+00 2.02471563e+02 -4.62207161e-01 -1.33819969e+01 1.53664046e+02
1716.lowfreq: -7.9456 -3.7843 -0.0009 -0.0005 0.0005 5.4223 12.5595 24.0464 28.6359
frequency: 12.0888 24.0389 28.6016 65.4120 69.3795 91.8914 99.5808 138.5654 151.2926 161.0481 171.3861 188.7087 256.7461 275.4345 296.9542 323.8959 343.9758 362.0485 366.7547 381.7837 388.0640 408.9987 409.4229 413.4717 437.7054 444.8317 465.7436 509.3808 527.7038 531.6560 541.3872 552.2418 603.9989 623.1181 627.2270 635.4618 644.4876 653.1597 692.8692 720.3602 726.9359 742.6525 783.8130 796.0125 814.2270 815.6186 822.4069 834.5741 838.6712 847.0967 860.5978 896.1972 939.8901 951.2112 954.3035 968.4880 979.1240 987.6275 988.1785 1002.0556 1003.7636 1012.0346 1018.9515 1022.7366 1031.3186 1046.4659 1080.6294 1102.6449 1116.2123 1136.2983 1162.8548 1186.2386 1199.3700 1214.0324 1236.1305 1243.9246 1288.4201 1294.6332 1299.9645 1309.0938 1314.7608 1325.7256 1349.4106 1376.6694 1391.5753 1395.7301 1414.9003 1443.5237 1446.1207 1455.5718 1457.7884 1461.7651 1492.8486 1533.5383 1560.0793 1563.8759 1565.1879 1581.9007 1612.7411 1615.9463 1623.5083 1634.2777 1645.7278 2997.5684 3075.9538 3115.6875 3118.2667 3133.1757 3133.3581 3134.5781 3135.7510 3140.1403 3147.0531 3148.1649 3154.4961 3160.4177 3163.3531 3172.8809 3565.6707 3705.8176
redmass: 4.0720 5.8139 6.1737 3.6221 5.2763 5.7610 3.5863 4.9327 2.0737 5.9450 1.6459 5.0042 4.8117 4.0699 4.4502 5.0088 3.5873 4.5917 1.3477 1.0354 5.0170 4.5873 2.7877 2.8938 3.6392 5.8995 3.7769 3.1626 5.1447 3.7697 4.8961 3.5633 4.1750 4.9648 6.2201 5.5407 6.3140 5.8539 4.4827 4.3277 4.2298 3.8185 1.4985 3.5359 1.3188 1.9667 3.3839 2.2752 1.3902 4.3133 2.9557 1.5193 1.3775 1.3653 1.4058 1.3807 1.3734 5.2728 3.8767 1.3294 3.1651 2.8968 1.4376 2.1594 2.1608 1.5500 3.1925 1.8701 1.3725 1.2474 1.1352 1.1170 1.1316 2.1271 3.0838 3.9023 2.1186 2.3522 1.3379 1.4773 3.9582 4.2200 2.6934 6.8930 9.6276 1.2477 3.8789 3.8161 1.4323 1.7815 2.6609 1.0581 2.6055 3.2834 6.6235 7.0913 6.4539 7.5266 8.6939 6.3493 8.3253 2.1977 1.7859 1.0381 1.0968 1.0870 1.0872 1.0860 1.0885 1.0990 1.0881 1.0948 1.0962 1.0900 1.0964 1.0974 1.0955 1.0998 1.0449 1.1040
irintensity: 0.1235 1.0576 1.0368 0.4074 0.6039 0.5353 4.1998 2.0682 1.2838 0.4553 0.3630 1.9641 1.0943 5.6928 1.5244 5.7436 6.1597 14.6422 290.4893 0.0485 16.5473 2.8347 1.2851 0.7532 2.3144 0.3168 1.0810 18.4986 6.0318 1.4610 2.1119 2.4577 11.4206 1.2523 6.4505 1.9449 3.7125 19.8935 14.5591 6.6272 5.9901 0.5344 77.5729 1.6602 0.9198 94.4128 16.6368 18.9021 1.3983 9.1028 1.3391 0.8498 0.3894 0.8799 1.5061 0.3626 2.8984 7.0483 0.8785 0.0154 4.5581 12.1554 0.5120 7.5260 0.4180 3.3726 21.8822 13.7734 10.2275 14.0490 0.2066 1.2942 76.7319 9.6274 18.2739 50.2996 13.5657 26.0049 4.9993 11.3903 226.0183 46.5394 1.2098 6.8075 28.4384 30.9297 1.3225 0.4248 15.0084 65.8203 47.3962 24.5201 289.6232 8.8359 223.4963 11.2346 22.1663 1.3277 316.1179 95.4620 66.3460 16.4855 428.8585 15.1245 8.5047 11.4770 43.7560 6.4295 5.8232 14.2574 16.8888 26.8559 6.5828 8.8881 19.8215 0.8679 12.7186 29.5461 130.0540 21.5553
temp: 298.150 k
press: 1.00000 atm
elementType: 8 7 7 7 6 6 6 6 6 6 6 6 6 6 6 6 6 6 6 6 6 6 6 6 6 1 1 1 1 1 1 1 1 1 1 1 1 1 1 1 1 1
symmnumber: 1
zpe: 859288.3 jmol-1
zpe.correction: 0.327286 hartree
zpe.thermalcorrener: 0.348041 hartree
zpe.thermalcorrenthalpy: 0.348985 hartree
zpe.thermalcorrgfe: 0.275884 hartree
zpe.sumelectzpe: -1048.245135 hartree
zpe.sumelectthermal: -1048.224380 hartree
zpe.sumelectthermalent: -1048.223436 hartree
zpe.sumelectthermalfe: -1048.296537 hartree
dipole: 5.0005 1.5891 0.3145
dipole: 5.2563
quadrupole: -84.4039 -147.4162 -140.7175
quadrupole: 1.1019 -0.1631 -8.0857
quadrupole: 39.7753 -23.2370 -16.5383 1.1019 -0.1631 -8.0857
hfenergy: -1048.5724207 hartree
pointgroup: C01 [X(C21H17N3O1)]
dipole: 1.9679495 0.6331185 0.0540163 debye
polarizability: 495.9619512|1.2554587|199.0275055|-0.9054699|-18.3089878|157.1067313 unknown
InChI: InChI=1S/C21H17N3O/c1-14-23-20-5-3-2-4-19(20)21(25)24(14)18-12-8-16(9-13-18)15-6-10-17(22)11-7-15/h2-13H,22H2,1H3
charge 0 multiplicity 1
42 atoms
O  -1.981904 -1.99769 -0.147187
N  -1.839879 0.345049 0.045806
N  -3.794236 1.753986 0.163526
N  8.207734 -0.350014 -0.042897
C  -0.3853 0.246164 0.035202
C  -2.476947 1.603824 0.157756
C  -4.044477 -0.709113 -0.056175
C  -2.58089 -0.888279 -0.05956
C  -4.600554 0.605303 0.052936
C  2.459976 0.049953 0.014352
C  0.325331 0.417777 -1.172005
C  0.311303 -0.036925 1.229416
C  1.730258 0.320275 -1.178888
C  1.716458 -0.128394 1.216444
C  3.943074 -0.051071 0.002544
C  -4.896042 -1.839829 -0.162403
C  -1.603472 2.82918 0.282585
C  -6.014846 0.761766 0.05294
C  -6.290138 -1.670621 -0.161498
C  4.730464 0.692391 -0.921221
C  4.638316 -0.897495 0.911404
C  -6.847602 -0.364284 -0.053421
C  6.132519 0.602329 -0.941455
C  6.039326 -1.003053 0.902003
C  6.816896 -0.251733 -0.027598
H  -0.223373 0.599203 -2.102637
H  -0.247256 -0.185937 2.15958
H  2.265669 0.415927 -2.129508
H  2.245928 -0.315348 2.15686
H  -4.433664 -2.829023 -0.244126
H  -0.971165 2.972653 -0.611672
H  -0.920472 2.755702 1.147647
H  -2.261424 3.700982 0.405639
H  -6.419919 1.774629 0.137691
H  4.239035 1.38119 -1.618213
H  4.070571 -1.515527 1.616258
H  -6.950063 -2.5407 -0.243794
H  -7.935962 -0.237287 -0.053193
H  6.707586 1.200855 -1.658722
H  6.539739 -1.678918 1.606402
H  8.694714 -0.956621 0.610132
H  8.760185 0.17592 -0.71355
