program: Gaussian 09
title: 000220264
version: EM64L-G09RevD.01
frameworkgroup: C1[X(C11H16O2S)]
method: RPBEPBE
basis: SDD
operation: Freq
keyword: #p
keyword: freq=noraman
keyword: PBEPBE/SDD
title: #p freq=noraman PBEPBE/SDD
converged: NO YES NO NO
title: Mulliken charges:
elementType: S O O C C C C C C C C C C C H H H H H H H H H H H H H H H H
charge: 0.870249 -0.567264 -0.567319 0.050559 -0.687675 -0.670001 -0.687854 -0.083536 -0.240167 -0.240869 -0.378111 -0.376627 0.449344 -0.800837 0.262052 0.224516 0.234521 0.257685 0.257272 0.215028 0.234882 0.224601 0.261629 0.285922 0.285743 0.242222 0.242190 0.228590 0.244615 0.228641
chargesum: 0.00000
title: Mulliken charges with hydrogens summed into heavy atoms:
elementType: S O O C C C C C C C C C C C
charge: 0.870249 -0.567264 -0.567319 0.050559 0.033413 0.059985 0.033258 -0.083536 0.045755 0.044874 -0.135890 -0.134437 0.449344 -0.098992
polarizability: 2.04007691e+02 7.16910052e-03 1.41858726e+02 2.19490419e+00 7.26173554e-02 1.10807129e+02
1716.lowfreq: -29.1315 -13.2354 -5.2866 -0.0022 -0.0019 -0.0017 6.3001 33.8587 50.1423
frequency: -28.4470 33.7778 50.1381 55.2368 125.3597 130.5723 176.2907 191.4687 214.8233 222.1920 245.1764 248.6646 249.8212 256.0983 294.6820 311.7196 365.9614 371.3687 401.8441 408.9043 414.1755 425.3377 471.9031 519.8883 589.8397 622.8948 711.3508 767.4025 774.3466 787.9881 830.4372 854.3130 906.3769 930.9206 931.8093 962.9152 963.3091 980.7068 991.0161 996.0825 1015.6909 1017.3173 1049.0860 1052.8484 1115.7647 1149.0438 1181.9846 1217.7652 1255.3164 1264.1599 1293.7791 1378.0779 1378.2698 1379.7115 1388.2763 1399.3020 1399.8588 1443.9099 1467.8609 1468.4844 1471.1587 1471.3526 1472.9224 1473.2555 1474.2581 1497.3482 1593.8800 1595.0637 2974.8990 2976.8836 2980.4765 2982.3480 3062.8036 3065.7414 3068.2826 3077.2823 3088.8946 3091.0548 3092.3557 3098.5915 3132.0856 3133.5552 3155.9427 3159.2806
redmass: 1.0205 2.9220 3.9048 3.9315 5.8806 4.1781 2.5037 1.2761 4.1242 6.5316 1.3568 1.2705 2.0542 2.7123 4.7024 3.1818 2.9047 2.8301 2.9841 2.8561 3.2804 3.2444 4.8398 3.7624 6.1357 6.9602 3.2965 3.6754 5.9717 7.8959 1.3840 1.2462 13.5124 1.4539 1.4177 1.2127 1.3098 1.3912 1.3930 5.2907 1.5298 1.5517 1.5947 2.4832 1.2848 1.7978 1.1573 2.9352 3.0378 3.1498 1.2698 1.2185 1.2149 5.7590 2.9483 1.2183 1.1938 1.0431 1.0499 1.0576 1.2402 1.0966 1.0713 1.7188 1.0666 1.0552 6.9482 6.0184 1.0361 1.0361 1.0387 1.0365 1.0950 1.0973 1.0972 1.0975 1.1011 1.1000 1.1005 1.1005 1.0888 1.0889 1.0953 1.0968
irintensity: 0.8881 0.2888 0.9339 2.0597 1.5239 0.1502 0.2066 0.1029 3.8045 27.5561 2.6736 0.6552 4.1130 0.7243 4.5057 0.0793 6.6905 0.1339 7.8505 0.0018 0.0538 12.0535 31.0027 62.0356 35.7098 0.2660 0.8542 3.2049 17.9574 65.2492 30.4794 0.7499 70.7080 0.2627 0.2259 0.0873 0.5768 0.1342 0.8766 2.8659 5.2760 2.8657 24.6303 25.5123 8.6886 141.6884 5.3850 4.6801 5.1089 7.6499 2.1861 37.2345 33.4254 1.3359 11.4813 10.8137 20.0560 0.5944 0.8379 4.2235 28.8931 20.6667 10.4369 5.0132 14.5465 27.9302 0.0171 10.0388 9.3307 17.6887 28.2651 30.9440 18.8597 0.3710 26.4695 16.0674 1.2748 15.4493 20.8636 8.8477 14.0556 7.1436 2.3815 12.1674
temp: 298.150 k
press: 1.00000 atm
elementType: 16 8 8 6 6 6 6 6 6 6 6 6 6 6 1 1 1 1 1 1 1 1 1 1 1 1 1 1 1 1
symmnumber: 1
zpe: 635775.3 jmol-1
zpe.correction: 0.242154 hartree
zpe.thermalcorrener: 0.257733 hartree
zpe.thermalcorrenthalpy: 0.258677 hartree
zpe.thermalcorrgfe: 0.199555 hartree
zpe.sumelectzpe: -976.060650 hartree
zpe.sumelectthermal: -976.045071 hartree
zpe.sumelectthermalent: -976.044126 hartree
zpe.sumelectthermalfe: -976.103249 hartree
dipole: 2.9703 -0.0161 5.8695
dipole: 6.5783
quadrupole: -75.9434 -92.4293 -101.9385
quadrupole: 0.0392 -9.5189 0.0256
quadrupole: 14.1603 -2.3255 -11.8348 0.0392 -9.5189 0.0256
hfenergy: -976.3028036 hartree
pointgroup: C01 [X(C11H16O2S1)]
dipole: -1.2177785 0.0440408 2.2832862 debye
polarizability: 204.0588512|-0.0745115|141.8487342|-0.1972539|-0.5642704|110.7659611 unknown
InChI: InChI=1S/C11H16O2S/c1-9-5-7-10(8-6-9)14(12,13)11(2,3)4/h5-8H,1-4H3
charge 0 multiplicity 1
30 atoms
S  1.38095 -0.018161 -0.819658
O  1.695112 -1.468379 -1.52836
O  1.697812 1.404495 -1.581178
C  2.440965 0.013611 0.926057
C  2.043218 -1.26648 1.662088
C  3.886993 0.009728 0.417073
C  2.035195 1.314969 1.618984
C  -0.464287 -0.007751 -0.387673
C  -1.120692 1.230168 -0.295828
C  -1.124811 -1.23922 -0.249959
C  -2.506614 1.225308 -0.020897
C  -2.510748 -1.219435 0.024189
C  -3.218138 0.006806 0.145228
C  -4.714044 0.013798 0.402576
H  2.20833 -2.153744 1.025302
H  2.674347 -1.370861 2.565701
H  0.988049 -1.247495 1.988211
H  4.091548 0.895636 -0.209292
H  4.098724 -0.897139 -0.1760
H  4.574517 0.028586 1.284348
H  0.978981 1.302099 1.941981
H  2.662251 1.451324 2.521209
H  2.199119 2.182053 0.954712
H  -0.567363 2.159669 -0.466797
H  -0.574627 -2.176375 -0.385851
H  -3.043288 2.178113 0.055056
H  -3.050713 -2.166959 0.135014
H  -5.029464 0.92126 0.946177
H  -5.275863 -0.009493 -0.551264
H  -5.030061 -0.865731 0.99005
