program: Gaussian 09
title: 000220262
version: EM64L-G09RevD.01
frameworkgroup: C1[X(C13H9BrO4S)]
method: RPBEPBE
basis: SDD
operation: Freq
keyword: #p
keyword: freq=noraman
keyword: PBEPBE/SDD
title: #p freq=noraman PBEPBE/SDD
converged: YES YES NO NO
title: Mulliken charges:
elementType: Br S O O O O C C C C C C C C C C C C C H H H H H H H H H
charge: 0.056762 0.849578 -0.511588 -0.532622 -0.362193 -0.225718 -0.188704 -0.027214 0.425646 -0.222101 -0.276183 -0.238692 -0.306857 -0.215467 -0.186863 -0.207349 -0.219483 0.068649 -0.214901 0.295995 0.291885 0.315799 0.252564 0.261650 0.241698 0.244034 0.237532 0.394143
chargesum: 0.00000
title: Mulliken charges with hydrogens summed into heavy atoms:
elementType: Br S O O O O C C C C C C C C C C C C C
charge: 0.056762 0.849578 -0.511588 -0.532622 0.031950 -0.225718 -0.188704 -0.027214 0.425646 0.073893 0.015701 0.077107 -0.306857 0.037097 0.074787 0.034349 0.024551 0.068649 0.022632
polarizability: 2.44490275e+02 1.12187932e+01 1.92664462e+02 -1.14154915e+01 -5.44000284e+00 1.35044710e+02
1716.lowfreq: -6.8925 -4.1398 -0.0009 0.0007 0.0013 6.3181 29.0690 29.6574 49.3855
frequency: 28.9674 29.6383 49.3490 76.7539 85.0099 114.8807 138.5149 150.8802 154.7057 170.2816 187.2079 202.5364 221.0554 247.5200 287.0565 315.8005 354.6951 375.6900 393.7354 404.2267 416.3139 442.7251 506.6657 535.9444 558.9445 570.0683 601.4925 605.5460 653.6565 687.3209 689.7574 696.3984 745.4561 749.6034 765.5583 789.9537 801.1498 854.9914 923.9256 929.1424 942.1372 974.9835 988.0921 989.2402 998.8321 1006.1920 1007.8239 1043.4797 1046.3232 1068.1132 1082.1396 1148.6915 1166.0197 1172.8892 1185.9782 1193.4750 1310.7163 1317.4587 1356.4454 1383.4890 1410.0549 1424.5824 1436.3580 1456.9314 1550.9364 1575.8612 1592.3398 1603.7651 1636.1587 3137.0083 3148.0286 3149.7486 3156.6087 3163.3098 3164.7074 3174.0537 3180.8708 3514.6101
redmass: 4.3085 8.5706 5.9630 9.6715 8.7524 11.4902 8.0085 7.2918 7.2604 5.5740 8.6417 10.9333 7.1236 8.7361 7.3242 6.9963 7.5199 6.5760 8.5792 2.8710 6.7475 6.4937 4.6765 5.6428 2.6842 1.6376 6.2814 5.0412 7.1982 5.1907 2.5989 6.5407 4.0660 5.5109 1.4819 6.3954 1.6549 1.2424 1.9510 3.4069 1.3853 4.9230 1.4338 1.5304 5.2000 1.3748 4.2570 3.7115 2.4340 2.0826 1.5927 1.6161 1.7559 1.0668 1.1252 1.3279 1.3825 2.2287 7.0556 8.0850 2.2300 3.3274 2.2762 1.9656 6.6821 5.6735 8.0099 6.8719 10.0124 1.0858 1.0886 1.0876 1.0929 1.0929 1.0967 1.1017 1.0989 1.0640
irintensity: 0.4629 0.5100 1.6871 6.7170 0.2753 1.0975 0.4574 1.3396 3.6541 4.8141 0.5492 2.0003 3.8609 6.8304 9.3229 0.7057 5.1434 5.2431 19.5019 0.1755 5.8021 66.3526 96.1337 29.5588 17.0020 66.2600 4.7826 40.5692 10.2749 63.1070 27.0649 25.2009 35.8004 12.5140 80.2242 86.2020 10.8076 1.7130 23.9506 45.9234 4.9688 0.5490 2.0984 7.7416 40.7189 0.2754 1.6868 189.8271 18.9561 64.0340 4.7113 11.6575 54.5210 1.7352 9.4354 9.0209 4.6815 64.1692 5.6814 7.1100 38.6607 16.4376 21.4402 23.1904 22.5004 4.3060 24.2514 2.4453 231.7101 2.4764 12.7913 10.1423 4.3619 2.3981 0.8370 44.1377 7.2372 59.7464
temp: 298.150 k
press: 1.00000 atm
elementType: 35 16 8 8 8 8 6 6 6 6 6 6 6 6 6 6 6 6 6 1 1 1 1 1 1 1 1 1
symmnumber: 1
zpe: 492691.4 jmol-1
zpe.correction: 0.187656 hartree
zpe.thermalcorrener: 0.205491 hartree
zpe.thermalcorrenthalpy: 0.206435 hartree
zpe.thermalcorrgfe: 0.139848 hartree
zpe.sumelectzpe: -1211.684536 hartree
zpe.sumelectthermal: -1211.666701 hartree
zpe.sumelectthermalent: -1211.665757 hartree
zpe.sumelectthermalfe: -1211.732344 hartree
dipole: -0.1165 0.3593 -5.0491
dipole: 5.0633
quadrupole: -111.8101 -115.8235 -132.3690
quadrupole: -5.5689 -13.8370 -10.6827
quadrupole: 8.1907 4.1774 -12.3681 -5.5689 -13.8370 -10.6827
hfenergy: -1211.8721924 hartree
pointgroup: C01 [X(C13H9Br1O4S1)]
dipole: 0.1081785 -0.5535381 1.9105243 debye
polarizability: 239.4560235|-20.3070887|198.0777008|-3.7501463|8.4260765|134.6657232 unknown
InChI: InChI=1S/C13H9BrO4S/c14-10-7-4-8-11(12(10)13(15)16)19(17,18)9-5-2-1-3-6-9/h1-8,15H
charge 0 multiplicity 1
28 atoms
Br -4.218449 1.245617 1.317842
S  0.660895 -0.440001 -1.432252
O  0.367292 0.924885 -2.280067
O  0.993885 -1.867624 -2.163707
O  -2.394935 2.122914 -1.401653
O  -0.713923 2.460364 0.168352
C  -0.900601 -0.778217 -0.36226
C  2.087072 -0.135227 -0.207985
C  -1.789505 0.26588 -0.026245
C  -1.115955 -2.123936 -0.037376
C  2.996461 -1.191082 -0.036102
C  2.204925 1.122462 0.404379
C  -2.933531 -0.107756 0.725589
C  -2.269859 -2.45827 0.704946
C  -3.175258 -1.44825 1.09496
C  4.09285 -0.971201 0.829833
C  3.30888 1.316983 1.26803
C  -1.537213 1.709967 -0.400089
C  4.244297 0.276534 1.479975
H  -0.411054 -2.883601 -0.39047
H  2.857406 -2.131801 -0.579179
H  1.469705 1.913952 0.22935
H  -2.467893 -3.499813 0.975413
H  -4.068486 -1.697981 1.673975
H  4.826147 -1.768748 0.988288
H  3.434181 2.281768 1.770155
H  5.09717 0.440519 2.147639
H  -2.195602 3.066963 -1.649038
