program: Gaussian 09
title: 000220258
version: EM64L-G09RevD.01
frameworkgroup: C1[X(C12H9BrO2S)]
method: RPBEPBE
basis: SDD
operation: Freq
keyword: #p
keyword: freq=noraman
keyword: PBEPBE/SDD
title: #p freq=noraman PBEPBE/SDD
converged: YES YES NO NO
title: Mulliken charges:
elementType: Br S O O C C C C C C C C C C C C H H H H H H H H H
charge: 0.053540 0.846728 -0.510494 -0.537987 0.022304 -0.021905 -0.219824 -0.241233 -0.233880 -0.267412 -0.176622 -0.221152 -0.207554 -0.209864 -0.216477 -0.217164 0.312790 0.275620 0.301388 0.258660 0.246654 0.240986 0.242361 0.242919 0.237618
chargesum: 0.00000
title: Mulliken charges with hydrogens summed into heavy atoms:
elementType: Br S O O C C C C C C C C C C C C
charge: 0.053540 0.846728 -0.510494 -0.537987 0.022304 -0.021905 -0.219824 0.071557 0.041740 0.033975 0.082038 0.025502 0.033433 0.032496 0.026442 0.020454
polarizability: 2.00264343e+02 -2.52848204e+01 1.81661875e+02 -4.91897715e+00 1.31821284e+01 1.24487090e+02
1716.lowfreq: -0.0005 0.0019 0.0028 1.6692 8.7403 11.7402 26.8016 39.1471 57.3229
frequency: 26.2823 39.0702 57.3114 107.2199 115.5998 143.1660 168.7481 193.4777 230.3967 241.6146 248.6090 303.1043 320.5214 384.0553 391.5088 404.4735 437.1416 463.2726 506.0470 520.7470 603.0099 622.9451 656.0549 677.9986 690.0997 706.5978 761.6947 770.0329 789.9856 849.5354 882.2788 924.9390 934.9894 971.8923 973.4434 979.5761 983.9784 1002.4039 1005.4859 1008.3388 1023.7703 1049.6618 1072.5057 1078.1917 1121.2245 1171.7627 1173.6412 1178.2733 1245.4476 1303.9081 1370.9759 1384.4617 1412.5945 1428.3647 1437.1364 1454.2064 1565.9801 1577.5732 1580.3375 1605.6836 3131.6755 3137.0761 3145.6777 3147.8882 3157.2407 3162.7495 3165.8378 3174.8339 3175.9007
redmass: 6.5802 5.5779 5.1453 8.6622 6.5555 6.9716 6.7656 7.9187 7.6414 6.8386 8.0776 8.1914 8.2864 7.6351 7.6018 2.8517 4.7127 4.8499 4.6938 4.5695 6.4787 6.8736 7.0567 7.3328 2.3332 4.3190 1.4639 1.2213 11.9888 1.2447 1.3346 14.7141 1.3728 6.9474 1.4058 5.3959 1.3981 1.3421 1.3408 4.2132 3.8639 2.1085 2.1336 1.5729 1.5976 1.0603 1.0572 1.1217 1.4043 1.2988 7.6859 8.1582 2.1242 2.2283 2.2726 2.0386 6.1569 5.8816 6.8723 6.9763 1.0888 1.0857 1.0884 1.0885 1.0926 1.0938 1.0966 1.1015 1.1004
irintensity: 0.6992 1.2375 0.4867 0.6845 0.6361 0.8724 3.0525 1.0096 1.7191 5.4047 4.3569 4.6742 3.1654 13.4898 22.2210 0.3333 10.9735 52.3250 100.4088 28.9140 0.0471 2.6239 4.6725 23.8382 35.5718 2.9527 70.5143 93.8126 51.0097 0.1241 0.4876 63.3752 2.4136 16.8109 1.0325 6.4018 0.1336 0.4578 0.2657 1.1058 7.1339 24.3077 33.9206 4.5198 0.6886 2.9601 0.1682 6.0392 11.1651 4.0828 6.3016 5.6507 10.9154 49.5500 19.2558 13.7515 1.6073 3.7307 15.5449 0.2240 13.4598 0.9292 0.3892 10.5484 2.9317 6.5362 3.3756 30.2318 16.9480
temp: 298.150 k
press: 1.00000 atm
elementType: 35 16 8 8 6 6 6 6 6 6 6 6 6 6 6 6 1 1 1 1 1 1 1 1 1
symmnumber: 1
zpe: 458960.6 jmol-1
zpe.correction: 0.174809 hartree
zpe.thermalcorrener: 0.189498 hartree
zpe.thermalcorrenthalpy: 0.190442 hartree
zpe.thermalcorrgfe: 0.131084 hartree
zpe.sumelectzpe: -1023.339271 hartree
zpe.sumelectthermal: -1023.324582 hartree
zpe.sumelectthermalent: -1023.323638 hartree
zpe.sumelectthermalfe: -1023.382996 hartree
dipole: 0.4264 1.1359 -6.1059
dipole: 6.2253
quadrupole: -85.5915 -107.7997 -118.5705
quadrupole: -8.5593 0.7006 8.6553
quadrupole: 18.3958 -3.8125 -14.5833 -8.5593 0.7006 8.6553
hfenergy: -1023.51408 hartree
pointgroup: C01 [X(C12H9Br1O2S1)]
dipole: -0.041406 0.7717163 -2.3240784 debye
dipolederiv: -0.0976254 0.2211228 0.0820419 0.1235278 -0.4316472 -0.1730522 0.0275796 -0.144763 -0.0447577 1.933809 0.1263947 0.1133746 0.0031796 1.0012047 -0.0988017 0.0615147 -0.0001888 1.4622381 -0.7024501 -0.0382316 0.0000235 0.0059649 -0.5398492 0.1687917 -0.0113485 0.0678095 -0.5874033 -0.7352144 -0.031958 -0.0312436 0.013879 -0.5418283 -0.1306483 0.0173869 -0.0660787 -0.6323178 -0.176415 0.0756741 0.0344209 -0.0977588 -0.3349285 -0.1373321 0.0093791 -0.0483939 -0.3032345 -0.0133906 0.0034382 -0.0788688 -0.0215377 -0.1078386 0.0152149 -0.1607937 -0.0159622 -0.1991487 0.044737 -0.525863 -0.2037371 -0.0101768 0.758427 0.4781988 0.07344 0.1794583 0.0700426 -0.2057946 0.0368929 -0.0020924 -0.102227 -0.0895685 -0.058961 -0.153002 0.0327658 -0.1262254 -0.2210241 -0.109813 0.0357643 0.1562657 -0.0233767 -0.0786461 0.0367664 0.0845521 -0.1027944 -0.191116 0.1200118 0.0144014 -0.1634176 -0.0482875 0.0715112 0.1024436 -0.0568886 -0.1003538 -0.1677607 0.2046413 0.0725663 0.0871256 -0.2392955 -0.031801 -0.0082423 0.0448103 -0.0364475 -0.0502619 -0.1457388 -0.0324595 -0.0444554 0.0515678 0.0787422 0.0391465 0.006641 -0.092505 -0.0753387 0.1093345 -0.0502073 0.0078071 0.0749894 -0.0279176 -0.0353854 -0.0927834 -0.0895592 -0.0504375 -0.1482546 -0.0392743 -0.0475759 0.0758978 0.0018977 -0.0621602 0.072419 -0.0927979 0.0496895 -0.0381556 0.1274171 -0.0923388 0.0514427 0.0369524 0.0729741 0.0873127 -0.004992 0.0535974 -0.0036615 -0.1354014 -0.0046556 -0.0128013 -0.0088218 -0.1209029 -0.0123612 -0.0415341 0.1934352 -0.0245384 -0.0120113 -0.0168878 0.1077175 -0.0203712 0.0129815 -0.0345029 0.1254123 0.1234284 0.0738838 0.030337 0.0637533 0.0560332 -0.0046259 0.0150902 -0.0383772 0.1285531 0.1659567 -0.0603046 0.0196772 -0.0375799 0.0656239 0.0092884 0.0080886 0.0208534 0.1250453 0.0724872 -0.0068047 -0.0671651 -0.0132184 0.0487944 -0.0816173 -0.0747988 -0.0771357 0.0527595 0.0355841 0.0893719 -0.0271431 0.1108252 -0.0228817 -0.0468769 -0.027987 -0.0505987 0.1120964 0.0505213 -0.0505658 0.0679709 -0.062446 -0.0474287 0.0581537 0.0814722 0.0561722 0.1083662 0.0312393 0.0670918 0.0618432 0.0870815 -0.036709 -0.0239446 0.0784468 -0.023775 0.1212854 -0.0275185 0.0587182 -0.0990408 0.0573301 0.086339 -0.0040806 -0.111877 0.0010002 0.074325 -0.0401377 -0.0026862 0.1188063 -0.0024643 0.0984035 0.0087475 0.1297874 0.0080149 0.0739475 unknown
polarizability: 201.8097418|-25.1143587|178.565493|-3.7429766|15.6615548|126.0380732 unknown
InChI: InChI=1S/C12H9BrO2S/c13-11-8-4-5-9-12(11)16(14,15)10-6-2-1-3-7-10/h1-9H
charge 0 multiplicity 1
25 atoms
Br -1.024919 -2.377625 -1.118712
S  0.108682 -0.08219 1.402317
O  0.04606 -1.565279 2.076765
O  0.164654 1.265828 2.333977
C  -1.434601 0.213821 0.270819
C  1.629827 -0.023853 0.268795
C  -1.910818 -0.687964 -0.69644
C  -2.102752 1.41954 0.551262
C  2.080694 1.231597 -0.168644
C  2.284303 -1.234826 0.000839
C  -3.085015 -0.363931 -1.415523
C  -3.276088 1.739684 -0.165408
C  3.252964 1.263297 -0.95961
C  3.459895 -1.180629 -0.784058
C  -3.762432 0.846645 -1.147079
C  3.935462 0.061617 -1.266527
H  -1.692584 2.07068 1.332651
H  1.555748 2.14888 0.116702
H  1.894321 -2.172766 0.408935
H  -3.462475 -1.055708 -2.174416
H  -3.805127 2.674086 0.045991
H  3.635663 2.222672 -1.323029
H  4.0012 -2.104405 -1.01301
H  -4.672806 1.084434 -1.707269
H  4.846144 0.095396 -1.874428
