program: Gaussian 09
title: 000220247
version: EM64L-G09RevD.01
frameworkgroup: C1[X(C6H12O4S)]
method: RPBEPBE
basis: SDD
operation: Freq
keyword: #p
keyword: freq=noraman
keyword: PBEPBE/SDD
title: #p freq=noraman PBEPBE/SDD
converged: YES YES NO NO
title: Mulliken charges:
elementType: S O O O O C C C C C C H H H H H H H H H H H H
charge: 0.953053 -0.562500 -0.550426 -0.453008 -0.214883 0.179426 -0.658586 -0.683831 -0.688282 0.202579 -0.749451 0.301847 0.282659 0.238660 0.206792 0.274712 0.227442 0.248813 0.226963 0.290896 0.278117 0.263341 0.385666
chargesum: 0.00000
title: Mulliken charges with hydrogens summed into heavy atoms:
elementType: S O O O O C C C C C C
charge: 0.953053 -0.562500 -0.550426 -0.067342 -0.214883 0.179426 -0.074080 0.036334 0.014937 0.202579 0.082904
polarizability: 1.16973224e+02 2.94154334e+00 1.01399531e+02 5.21145079e+00 -3.57603323e-01 9.10429392e+01
1716.lowfreq: -15.8231 -7.4254 -0.0021 -0.0016 -0.0013 9.9827 49.3775 65.4194 104.3376
frequency: 49.1202 65.3149 104.3288 126.9827 175.6783 186.3485 192.2819 199.8139 221.6662 239.9000 248.4970 257.1861 293.1416 321.6338 344.9661 355.1438 400.8903 490.1077 541.0780 566.7770 580.5836 605.7827 694.9868 711.4197 785.5196 837.6242 877.7481 900.1456 941.1103 955.9271 971.3744 1003.3027 1011.8595 1033.4865 1093.4016 1143.7543 1222.8593 1240.6194 1257.2033 1294.2204 1308.3989 1374.6029 1394.5853 1410.8580 1415.3449 1423.6347 1457.6842 1470.0235 1474.1263 1499.8619 1678.5600 2986.0681 2999.1416 3028.8030 3046.3843 3089.0880 3096.3714 3101.5086 3115.2730 3141.6019 3177.2293 3185.2032 3520.6737
redmass: 6.2485 5.7143 5.0752 4.5602 1.2820 2.4415 3.7731 1.5667 1.9501 2.6753 1.5194 2.2433 3.7326 6.7951 3.0566 2.5852 4.8295 3.4313 4.1087 2.7803 2.8332 2.2987 3.9817 5.1009 10.0997 2.1270 3.6289 1.8216 1.8564 1.5201 1.3217 1.6668 1.5486 2.1601 1.3852 2.0019 1.5983 2.0608 1.6078 1.1859 2.3681 1.1673 1.1487 1.1354 1.0542 1.0588 1.0476 1.0529 1.0528 1.0598 8.8912 1.0338 1.0362 1.0245 1.0552 1.1012 1.1009 1.0998 1.1004 1.1107 1.1070 1.1080 1.0640
irintensity: 5.9363 1.5210 1.1626 7.0877 0.4721 0.4171 1.2945 1.1604 3.0074 0.6377 1.2573 3.7405 4.4670 20.2071 8.6641 3.0665 33.1345 16.3092 4.5783 44.1744 38.4557 60.9852 4.5564 52.7261 43.8879 14.3188 46.4379 19.9941 8.2947 1.9134 33.5292 72.0053 42.5547 186.7836 6.2316 2.5700 10.1951 5.9024 3.6548 13.2785 13.5043 12.4421 36.1667 14.2683 11.1207 6.0765 8.5705 6.4045 13.0989 14.7084 216.4019 20.1502 19.8573 1.1284 4.6429 19.2131 7.6302 19.5952 6.7590 1.8030 0.7822 0.2726 31.0364
temp: 298.150 k
press: 1.00000 atm
elementType: 16 8 8 8 8 6 6 6 6 6 6 1 1 1 1 1 1 1 1 1 1 1 1
symmnumber: 1
zpe: 466177.6 jmol-1
zpe.correction: 0.177558 hartree
zpe.thermalcorrener: 0.191432 hartree
zpe.thermalcorrenthalpy: 0.192376 hartree
zpe.thermalcorrgfe: 0.137843 hartree
zpe.sumelectzpe: -933.745783 hartree
zpe.sumelectthermal: -933.731909 hartree
zpe.sumelectthermalent: -933.730964 hartree
zpe.sumelectthermalfe: -933.785497 hartree
dipole: -1.2116 1.6155 5.8554
dipole: 6.1939
quadrupole: -80.2289 -69.3275 -78.3064
quadrupole: 11.8497 1.6646 2.1706
quadrupole: -4.2746 6.6268 -2.3521 11.8497 1.6646 2.1706
hfenergy: -933.9233404 hartree
pointgroup: C01 [X(C6H12O4S1)]
dipole: -0.3936961 -0.0509229 2.4043089 debye
dipolederiv: 1.4070743 -0.0275597 0.0153752 -0.0973946 1.1843811 0.0280459 0.1131037 0.0509098 1.1660001 -0.7216458 0.0612976 0.0790312 0.1045319 -0.6128193 -0.1063183 0.0235917 -0.0025922 -0.515734 -0.7572755 0.0105477 -0.0396505 0.038585 -0.6023289 0.1332756 -0.0541728 0.0396002 -0.5676436 -0.623001 -0.1367625 -0.2109261 -0.246879 -0.5342239 -0.377022 -0.1980057 -0.3414937 -0.7476054 -0.7104154 0.1146936 -0.2907065 0.3112535 -0.625557 0.1376577 -0.256758 -0.0303445 -0.5363696 0.0479577 -0.0358114 0.0003626 -0.1095235 -0.2053523 0.0420769 0.1645873 0.1345962 -0.0152345 0.1433252 0.0655097 -0.0486203 0.0275888 -0.0816684 0.0323944 -0.0376108 -0.0185565 -0.1028954 -0.0414772 -0.0083925 0.0158781 -0.0083058 0.0462462 -0.0172928 0.0052244 0.0314676 -0.0611599 -0.0963501 0.026164 0.0329733 0.0738007 0.0558581 -0.0032606 -0.1215545 -0.0638273 0.0789417 0.9479963 -0.1012131 0.5534124 -0.1352477 1.1009734 0.1768285 0.484915 0.2333815 0.8346234 -0.1913155 -0.0317615 -0.0229276 -0.0480406 -0.1454885 -0.0677365 -0.0522412 -0.0942908 -0.209109 -0.0054655 -0.0002469 0.0239086 0.022031 -0.0308862 0.0156801 0.0552991 0.0048773 0.0792481 0.0016974 -0.055658 0.0074201 -0.0796546 0.0718778 -0.0363645 -0.017372 -0.0256583 -0.0586931 -0.0915089 0.0071365 -0.0860835 0.0400722 0.1094009 0.0072436 -0.0464612 -0.0103384 0.0793207 0.0964935 0.051317 -0.0087436 0.0204155 -0.134061 -0.0208261 0.0030285 0.031405 0.0664022 0.0646547 -0.0201511 0.0959952 -0.0021337 0.0752946 0.0622469 0.0773037 0.0115774 0.0508021 0.0954275 0.0472745 0.0111675 0.0188921 -0.1295405 0.0234461 0.0211922 0.0070061 0.0860103 -0.1178406 -0.0084334 -0.0250991 0.023676 0.0949136 0.0323156 -0.0619439 0.0241448 0.0572303 0.096237 -0.0163567 -0.0314703 -0.0107523 0.064342 -0.0863335 0.0231487 -0.0551029 -0.1170223 0.0267529 -0.0522809 0.0271577 -0.062995 0.0797309 0.0181256 0.0147303 0.0105318 0.0631575 0.0608621 0.0303825 0.0127637 0.0519624 0.0374923 -0.0543388 0.0173287 -0.0590423 0.0483842 0.0771661 0.0113937 -0.0553184 0.0017369 0.0057744 0.0356126 -0.0688237 0.0338714 0.0033917 0.2906507 0.0689109 -0.0558997 0.066381 0.1756406 0.0245438 -0.0885094 0.0878779 0.3179546 unknown
polarizability: 117.3779542|1.2220098|100.7082752|4.9705695|2.4581133|91.3294647 unknown
InChI: InChI=1S/C6H12O4S/c1-6(2,5(7)8)4-11(3,9)10/h7H,4H2,1-3H3
charge 0 multiplicity 1
23 atoms
S  1.877866 -0.287245 -0.200408
O  2.85684 -1.491912 -0.71622
O  1.269771 0.800286 -1.270106
O  -0.558937 1.386759 1.132983
O  -2.10848 1.2550 -0.5893
C  -0.960588 -0.818255 0.143165
C  0.398508 -1.131117 0.780335
C  -1.085324 -1.386393 -1.293484
C  -2.055222 -1.46421 1.062223
C  -1.262743 0.688624 0.126256
C  2.825535 0.708805 1.13165
H  0.664652 -2.198339 0.715256
H  0.490642 -0.739484 1.804926
H  -2.094425 -1.184674 -1.688285
H  -0.917686 -2.478369 -1.282004
H  -0.354406 -0.912283 -1.969128
H  -1.912769 -2.558674 1.103278
H  -3.054453 -1.260479 0.64011
H  -2.017709 -1.062807 2.090749
H  3.627696 1.217344 0.579125
H  2.103339 1.411184 1.568615
H  3.222505 -0.017193 1.855027
H  -0.808013 2.348633 1.078037
