program: Gaussian 09
title: 000220246
version: EM64L-G09RevD.01
frameworkgroup: C1[X(C14H10O2S)]
method: RPBEPBE
basis: SDD
operation: Freq
keyword: #p
keyword: freq=noraman
keyword: PBEPBE/SDD
title: #p freq=noraman PBEPBE/SDD
converged: YES YES NO NO
title: Mulliken charges:
elementType: S O O C C C C C C C C C C C C C C H H H H H H H H H H
charge: 0.880858 -0.518373 -0.517229 -0.032575 -0.248693 -0.251852 -0.207911 -0.208017 -0.215199 0.302306 -0.277601 -0.366257 -0.369823 -0.209377 -0.209586 0.153036 -0.230527 0.289500 0.290240 0.242658 0.242581 0.238156 0.258173 0.254303 0.237530 0.236736 0.236943
chargesum: 0.00000
title: Mulliken charges with hydrogens summed into heavy atoms:
elementType: S O O C C C C C C C C C C C C C C
charge: 0.880858 -0.518373 -0.517229 -0.032575 0.040807 0.038388 0.034747 0.034564 0.022957 0.302306 -0.277601 -0.108084 -0.115520 0.028153 0.027150 0.153036 0.006416
polarizability: 2.74862334e+02 -4.88688768e-02 1.42008720e+02 4.15904760e+00 1.74165008e+01 1.57261795e+02
1716.lowfreq: -3.5447 0.0001 0.0008 0.0009 4.1047 8.5862 11.1732 22.3951 26.6726
frequency: 10.2467 22.3106 26.5032 48.4645 90.0598 131.2142 148.0321 154.1867 198.3719 242.3385 260.8592 294.4143 362.6479 380.5012 395.8173 399.5046 403.5065 457.5951 494.2873 514.0602 543.6204 583.3010 601.7553 617.2512 655.3577 689.6816 694.8368 761.0240 775.7195 785.3414 800.5000 850.0886 855.4005 927.0484 933.2920 934.5442 977.3973 982.5763 983.0003 986.2486 1003.9191 1005.0938 1008.1373 1025.0306 1047.9757 1076.6970 1082.7758 1173.3298 1176.3488 1176.8321 1189.8670 1229.8326 1301.9314 1315.0346 1372.4780 1383.8255 1433.7959 1437.2225 1452.2397 1477.6909 1575.8337 1576.5464 1606.3743 1606.8128 2196.4474 3134.7758 3137.5577 3143.8362 3147.6947 3155.0680 3155.6950 3164.7980 3164.8665 3174.7241 3174.9470
redmass: 3.8966 6.4989 4.0770 7.0128 5.9985 6.3181 7.8152 6.5802 6.7642 8.9515 8.4866 7.7741 5.5789 8.3127 5.9985 3.4893 2.8516 14.3739 4.0145 7.8695 3.8548 9.1641 6.4809 6.6248 7.1540 2.3890 1.8762 1.4622 1.7221 12.5460 6.5319 1.2425 1.2470 16.9875 1.3593 1.4193 6.1180 1.3881 1.3848 6.2479 1.3288 1.3390 4.1254 2.2031 2.1451 1.5397 1.6034 1.0565 1.1249 1.0561 1.1133 3.8223 1.3024 1.3758 5.9673 8.0675 2.3240 2.2793 2.0389 2.2741 5.6817 5.8206 7.0111 5.9826 12.0021 1.0853 1.0858 1.0883 1.0883 1.0931 1.0927 1.0971 1.0973 1.1017 1.1018
irintensity: 0.3450 1.4578 0.1431 0.1659 0.2741 0.5196 1.1736 1.8125 1.1280 8.0348 0.2001 2.7128 1.6397 45.5641 6.8427 2.7873 0.1132 159.4324 54.3468 0.9391 20.6511 136.8965 0.0123 0.1618 16.9309 34.2937 45.9316 81.6864 58.1512 100.1857 76.8017 0.5730 0.0133 78.2808 1.3867 6.1054 2.3112 0.0129 0.0066 0.8458 0.0545 0.2657 1.1018 13.8811 26.6100 4.0133 7.9321 0.0350 8.0644 0.0074 1.5255 17.4106 3.7385 0.1552 0.2694 5.7891 11.8946 15.9956 14.6448 27.2893 1.2725 5.3511 0.2387 0.0763 283.2775 0.4075 1.2089 3.0301 10.7220 14.2549 0.7172 0.9364 22.8498 36.2823 12.3590
temp: 298.150 k
press: 1.00000 atm
elementType: 16 8 8 6 6 6 6 6 6 6 6 6 6 6 6 6 6 1 1 1 1 1 1 1 1 1 1
symmnumber: 1
zpe: 511158.0 jmol-1
zpe.correction: 0.194690 hartree
zpe.thermalcorrener: 0.210232 hartree
zpe.thermalcorrenthalpy: 0.211177 hartree
zpe.thermalcorrgfe: 0.147757 hartree
zpe.sumelectzpe: -1086.570747 hartree
zpe.sumelectthermal: -1086.555204 hartree
zpe.sumelectthermalent: -1086.554260 hartree
zpe.sumelectthermalfe: -1086.617680 hartree
dipole: 2.1694 -6.4991 1.2579
dipole: 6.9661
quadrupole: -76.5184 -115.5081 -101.5422
quadrupole: 12.6124 -1.3127 6.2863
quadrupole: 21.3378 -17.6519 -3.6860 12.6124 -1.3127 6.2863
hfenergy: -1086.7654368 hartree
pointgroup: C01 [X(C14H10O2S1)]
dipole: -0.7780335 2.3452156 -1.1856961 debye
polarizability: 274.2827133|-8.404134|131.3821607|-4.8100918|3.6776383|168.4679749 unknown
InChI: InChI=1S/C14H10O2S/c15-17(16,14-9-5-2-6-10-14)12-11-13-7-3-1-4-8-13/h1-10H
charge 0 multiplicity 1
27 atoms
S  1.441938 -1.451781 0.827642
O  1.651306 -1.489998 2.446887
O  1.572592 -2.799733 -0.084937
C  2.636555 -0.155003 0.116431
C  3.095641 0.851006 0.979542
C  3.046397 -0.307802 -1.216392
C  4.013886 1.788324 0.450917
C  3.965509 0.640304 -1.724264
C  4.440275 1.684143 -0.894703
C  -2.700975 0.067747 0.167718
C  -0.176512 -0.73027 0.514043
C  -3.492208 0.439258 1.293687
C  -3.26515 0.134098 -1.139334
C  -4.822298 0.867071 1.109964
C  -4.596136 0.564121 -1.311226
C  -1.350187 -0.372499 0.352512
C  -5.377892 0.931347 -0.190088
H  2.765002 0.883734 2.022907
H  2.679028 -1.144881 -1.819256
H  4.397759 2.590316 1.089798
H  4.312225 0.558188 -2.759535
H  5.153875 2.412511 -1.294908
H  -3.05693 0.384618 2.296712
H  -2.656622 -0.155097 -2.002253
H  -5.426327 1.149313 1.978758
H  -5.025435 0.611659 -2.317598
H  -6.412318 1.263907 -0.328421
