program: Gaussian 09
title: 000220241
version: EM64L-G09RevD.01
frameworkgroup: C1[X(C10H14O4S2)]
method: RPBEPBE
basis: SDD
operation: Freq
keyword: #p
keyword: freq=noraman
keyword: PBEPBE/SDD
title: #p freq=noraman PBEPBE/SDD
converged: YES YES NO NO
title: Mulliken charges:
elementType: S S O O O O C C C C C C C C C C H H H H H H H H H H H H H H
charge: 0.887239 0.968553 -0.548596 -0.580623 -0.586321 -0.560305 -0.577596 -0.580087 -0.045672 -0.753531 -0.234710 -0.278134 0.452139 -0.375808 -0.366826 -0.797871 0.311415 0.332344 0.314011 0.314311 0.286545 0.264390 0.335879 0.321392 0.299027 0.247498 0.245390 0.230464 0.243241 0.232242
chargesum: 0.00000
title: Mulliken charges with hydrogens summed into heavy atoms:
elementType: S S O O O O C C C C C C C C C C
charge: 0.887239 0.968553 -0.548596 -0.580623 -0.586321 -0.560305 0.066163 0.048234 -0.045672 0.133282 0.086683 0.020893 0.452139 -0.128310 -0.121437 -0.091924
polarizability: 2.35198816e+02 5.18381866e+00 1.67868834e+02 5.67221161e+00 -8.48564297e+00 1.17301973e+02
1716.lowfreq: -56.8373 -9.8684 -1.1515 0.0007 0.0014 0.0019 15.1395 40.3011 45.5248
frequency: -56.6251 40.0854 45.5023 57.1965 78.5495 107.9313 115.0511 149.7130 165.2990 181.0888 187.4094 205.2969 230.9698 238.6378 246.8419 278.5265 300.1267 320.9187 328.6220 351.1799 372.7569 393.6856 408.7474 464.8900 475.5366 489.4154 535.7019 578.9777 591.5179 621.8352 705.5114 770.0421 777.2712 792.8481 834.4908 842.9539 848.4918 857.0550 887.8369 922.8861 972.0736 986.4540 988.2866 993.2758 995.9511 1025.0809 1046.4602 1048.9492 1049.3295 1115.3678 1124.1163 1136.0831 1192.2135 1217.1456 1222.0587 1270.1606 1305.2881 1305.7629 1380.0065 1385.4709 1392.3821 1393.3044 1397.2720 1414.5604 1432.3930 1469.0350 1472.4505 1475.4486 1591.0311 1593.6557 2980.8995 3014.6914 3020.1316 3039.0805 3063.7990 3093.0816 3118.9664 3124.9234 3131.5447 3136.2721 3144.6801 3158.8672 3166.4925 3178.7562
redmass: 1.0134 4.3791 4.3530 6.4517 5.2743 5.5885 5.7833 5.0539 5.7731 3.4340 1.4187 3.4561 5.0500 2.7831 3.9126 4.9023 4.8770 5.2358 5.9287 6.0761 3.6357 4.2513 2.9604 4.4467 4.1165 3.9219 5.0119 7.1428 6.5261 6.9667 3.3730 6.0319 5.7043 9.6943 1.3639 1.9139 1.9830 1.2447 4.0100 5.8665 1.2969 1.4751 1.8546 1.9591 1.5613 1.4682 2.1762 1.6544 2.3377 1.0710 1.2980 1.4365 1.1376 2.6116 1.3253 1.2043 1.2536 1.1366 5.6300 1.1673 1.1194 2.4978 1.2211 1.0495 1.0549 1.1035 1.0623 2.2091 6.4375 6.1987 1.0389 1.0247 1.0576 1.0565 1.0948 1.1002 1.0924 1.1070 1.1091 1.0889 1.0953 1.0964 1.1085 1.1072
irintensity: 0.5564 1.5537 1.8667 4.1301 9.1811 10.3572 2.9576 2.5076 3.7586 5.7049 0.4715 2.8150 9.0256 16.1130 2.5015 2.9107 20.1639 24.4343 10.8761 2.9764 4.6731 14.4425 1.6051 15.2747 16.3597 16.1114 58.4204 25.6737 33.5214 3.5393 4.8712 8.7975 25.6660 94.7152 32.4991 26.0480 13.6385 0.2918 80.9178 124.4277 2.5563 1.8594 4.1602 2.1081 13.7729 83.7788 28.9929 13.8031 20.7407 5.9493 4.1078 2.8557 15.7839 3.6519 4.8092 0.7551 0.9521 18.4994 1.3867 41.0904 21.6453 8.9603 16.7969 3.5556 10.9839 18.2648 14.9619 32.8852 1.7086 9.9966 23.6031 15.2690 11.7360 1.7111 18.9609 13.9269 39.9682 6.1994 4.5185 9.8531 15.7273 14.3020 12.9191 0.4074
temp: 298.150 k
press: 1.00000 atm
elementType: 16 16 8 8 8 8 6 6 6 6 6 6 6 6 6 6 1 1 1 1 1 1 1 1 1 1 1 1 1 1
symmnumber: 1
zpe: 583566.2 jmol-1
zpe.correction: 0.222269 hartree
zpe.thermalcorrener: 0.239967 hartree
zpe.thermalcorrenthalpy: 0.240911 hartree
zpe.thermalcorrgfe: 0.176477 hartree
zpe.sumelectzpe: -1484.938506 hartree
zpe.sumelectthermal: -1484.920808 hartree
zpe.sumelectthermalent: -1484.919863 hartree
zpe.sumelectthermalfe: -1484.984297 hartree
dipole: -3.1861 -0.5433 -0.3797
dipole: 3.2544
quadrupole: -97.1734 -124.2093 -111.3405
quadrupole: 16.0085 9.6761 -11.6597
quadrupole: 13.7344 -13.3016 -0.4328 16.0085 9.6761 -11.6597
hfenergy: -1485.1607743 hartree
pointgroup: C01 [X(C10H14O4S2)]
dipole: -1.2464663 -0.2925321 0.0086232 debye
polarizability: 234.805243|9.4607751|144.8561481|1.4525231|-26.6593418|140.7082315 unknown
InChI: InChI=1S/C10H14O4S2/c1-9-3-5-10(6-4-9)16(13,14)8-7-15(2,11)12/h3-6H,7-8H2,1-2H3
charge 0 multiplicity 1
30 atoms
S  0.393294 1.411368 -0.822129
S  3.370512 -0.751649 0.232787
O  -0.080208 2.558997 -1.887491
O  1.242122 1.848968 0.516722
O  1.992635 -1.611312 0.505275
O  4.769563 -1.529121 -0.095158
C  1.571947 0.167428 -1.782287
C  2.992069 0.403021 -1.328359
C  -1.141391 0.426548 -0.324329
C  3.647169 0.401375 1.727396
C  -1.021349 -0.645148 0.576552
C  -2.361951 0.872321 -0.855224
C  -3.476527 -0.904356 0.443607
C  -2.211548 -1.308425 0.949765
C  -3.533709 0.191744 -0.457816
C  -4.73975 -1.645259 0.841314
H  1.396202 0.424198 -2.838664
H  1.202163 -0.8406 -1.522375
H  3.196085 1.430721 -0.98661
H  3.743587 0.05013 -2.053209
H  3.714848 -0.277754 2.588654
H  4.593176 0.927874 1.538789
H  2.770895 1.065673 1.753322
H  -0.043951 -0.96492 0.957574
H  -2.384536 1.725569 -1.541601
H  -2.152368 -2.152806 1.645933
H  -4.503078 0.519144 -0.850511
H  -5.626364 -0.989612 0.796447
H  -4.925312 -2.497708 0.159528
H  -4.665125 -2.054508 1.863598
