program: Gaussian 09
title: 000220231
version: EM64L-G09RevD.01
frameworkgroup: C1[X(C13H9NO3S)]
method: RPBEPBE
basis: SDD
operation: Freq
keyword: #p
keyword: freq=noraman
keyword: PBEPBE/SDD
title: #p freq=noraman PBEPBE/SDD
converged: NO YES NO NO
title: Mulliken charges:
elementType: S O O O N C C C C C C C C C C C C C H H H H H H H H H
charge: 0.779453 -0.521896 -0.543548 -0.416217 -0.072203 -0.197661 -0.214562 0.386920 0.393420 0.007891 -0.269236 -0.269049 -0.340179 -0.314614 -0.223617 -0.222538 -0.221827 -0.235320 0.289953 0.293147 0.269672 0.285444 0.245838 0.246708 0.238901 0.239328 0.385793
chargesum: 0.00000
title: Mulliken charges with hydrogens summed into heavy atoms:
elementType: S O O O N C C C C C C C C C C C C C
charge: 0.779453 -0.521896 -0.543548 -0.030423 -0.072203 -0.197661 -0.214562 0.386920 0.393420 0.007891 0.020716 0.024098 -0.070507 -0.029170 0.022220 0.024170 0.017074 0.004008
polarizability: 2.35122593e+02 -1.85031903e+00 2.06567999e+02 -8.56202019e-01 9.76783455e+00 1.07502888e+02
1716.lowfreq: -7.2783 -5.9948 -2.8541 -0.0020 0.0008 0.0016 42.4117 95.3999 96.3908
frequency: 42.3985 95.3991 96.3906 102.1207 136.9262 179.9925 191.7679 209.8378 231.0159 258.5155 284.5671 301.2580 327.5843 353.9687 381.9840 409.8911 426.1203 443.9884 477.9535 484.6232 507.4336 522.7792 565.2320 631.8874 646.0345 653.3852 683.8961 715.5810 730.6783 743.1258 770.9582 786.9263 800.5173 883.6258 887.7769 893.3985 921.8315 951.0396 968.0376 969.8295 999.6294 1001.3818 1009.9249 1014.9202 1031.4704 1042.5900 1118.0244 1123.3917 1162.9355 1173.9167 1178.8434 1237.1463 1265.8598 1286.5823 1323.0567 1372.2206 1380.2381 1424.2143 1428.0865 1451.8217 1460.4669 1545.0433 1561.1992 1575.6720 1599.9679 1611.5333 3141.9498 3142.1526 3151.8764 3152.6143 3167.3990 3170.5421 3177.8574 3200.1427 3554.6005
redmass: 7.0654 6.4139 5.1997 4.9368 7.3643 5.9056 8.1267 5.8926 9.6889 7.4199 9.1376 5.5438 5.6756 6.5305 7.4767 3.6893 6.3644 3.5434 2.2976 2.8137 3.6267 4.3293 5.3997 6.4306 6.0083 5.1019 7.2070 4.2930 6.1746 2.8077 1.2408 1.5739 14.8638 1.6648 1.7625 2.4292 19.2602 4.7136 1.4177 1.5283 1.3499 1.3518 6.8838 7.3976 2.3419 1.8859 1.7919 1.7518 1.8885 1.0732 1.1561 1.6143 1.4940 1.4415 2.2740 7.0041 5.6674 2.4081 2.4224 2.3977 2.6784 5.5681 5.7241 6.8046 6.9667 7.3479 1.0864 1.0867 1.0918 1.0909 1.0952 1.0988 1.0996 1.0949 1.0675
irintensity: 3.3514 1.7277 0.6358 0.5872 0.0413 2.2324 10.4497 0.2247 4.2623 2.4778 2.5730 4.0256 3.3834 2.1453 20.7861 64.6877 13.8829 13.4703 23.9767 43.5404 56.2644 22.7551 7.2578 7.9900 7.2081 23.6711 43.7498 1.3275 7.3758 29.2046 14.0146 109.2022 73.3521 45.0911 28.6859 64.0042 79.4204 35.1914 3.0733 6.3158 0.8360 0.5830 0.9687 4.8929 1.0203 5.6821 5.3727 5.8485 20.0296 1.5639 2.6736 26.5248 4.5092 96.3972 18.5202 2.6024 2.2331 11.3318 12.2941 14.7464 12.7264 0.4507 3.2322 2.1681 4.6879 1.1843 2.7906 6.6714 2.8983 2.0313 7.7976 19.3429 16.5496 3.8839 92.5129
temp: 298.150 k
press: 1.00000 atm
elementType: 16 8 8 8 7 6 6 6 6 6 6 6 6 6 6 6 6 6 1 1 1 1 1 1 1 1 1
symmnumber: 1
zpe: 495909.2 jmol-1
zpe.correction: 0.188882 hartree
zpe.thermalcorrener: 0.203862 hartree
zpe.thermalcorrenthalpy: 0.204806 hartree
zpe.thermalcorrgfe: 0.147181 hartree
zpe.sumelectzpe: -1177.794647 hartree
zpe.sumelectthermal: -1177.779667 hartree
zpe.sumelectthermalent: -1177.778723 hartree
zpe.sumelectthermalfe: -1177.836348 hartree
dipole: -0.8324 5.5552 -3.8581
dipole: 6.8146
quadrupole: -84.3211 -107.2165 -120.4428
quadrupole: 1.9948 -0.9661 7.0930
quadrupole: 19.6724 -3.2230 -16.4493 1.9948 -0.9661 7.0930
hfenergy: -1177.9835292 hartree
pointgroup: C01 [X(C13H9N1O3S1)]
dipole: -0.2319365 -2.1389084 1.5998184 debye
polarizability: 234.939724|2.9889688|207.3360883|-0.6311395|6.082683|106.9176683 unknown
InChI: InChI=1S/C13H9NO3S/c15-14-13-9-5-1-3-7-11(9)18(16,17)12-8-4-2-6-10(12)13/h1-8,15H
charge 0 multiplicity 1
27 atoms
S  0.178775 1.739124 -0.825237
O  0.139498 1.559743 -2.448258
O  0.30443 3.240779 -0.185522
O  -1.306274 -3.184798 -1.031069
N  -0.011225 -2.575182 -0.797425
C  1.525448 0.634439 -0.11645
C  -1.316039 0.866738 -0.071572
C  1.261753 -0.751343 -0.027176
C  -1.312557 -0.549547 0.001332
C  -0.08546 -1.336967 -0.322205
C  2.747677 1.229061 0.224626
C  -2.383531 1.679746 0.326513
C  2.334618 -1.572119 0.417123
C  -2.504048 -1.151466 0.499371
C  3.795628 0.389501 0.664259
C  -3.548092 1.052607 0.824927
C  3.585055 -1.008253 0.745008
C  -3.599876 -0.358202 0.901345
H  2.866839 2.314938 0.149833
H  -2.294696 2.768924 0.255235
H  2.164226 -2.648499 0.507509
H  -2.55884 -2.238264 0.573518
H  4.76309 0.820664 0.940097
H  -4.401594 1.657818 1.146414
H  4.396345 -1.661235 1.083552
H  -4.501251 -0.848886 1.283399
H  -1.0612 -4.031324 -1.487148
