program: Gaussian 09
title: 000220200
version: EM64L-G09RevD.01
frameworkgroup: C1[X(C19H20O7)]
method: RPBEPBE
basis: SDD
operation: Freq
keyword: #pfreq=noraman
keyword: PBEPBE/SDD
title: #p freq=noraman PBEPBE/SDD
converged: NO YES NO NO
title: Mulliken charges:
elementType: O O O O O O O C C C C C C C C C C C C C C C C C C C H H H H H H H H H H H H H H H H H H H H
charge: -0.504386 -0.485816 -0.469791 -0.321256 -0.312429 -0.252283 -0.248494 -0.103070 -0.119752 -0.084470 -0.350323 -0.304356 0.208553 0.212262 0.230694 0.215618 -0.331938 -0.344307 -0.334713 -0.330738 -0.216535 -0.224041 -0.215415 -0.238978 -0.217571 -0.226779 0.240061 0.255386 0.223679 0.261500 0.258781 0.239964 0.264206 0.380067 0.368198 0.376659 0.263436 0.269656 0.262632 0.288374 0.237859 0.232530 0.236192 0.243508 0.237602 0.230027
chargesum: 0.00000
title: Mulliken charges with hydrogens summed into heavy atoms:
elementType: O O O O O O O C C C C C C C C C C C C C C C C C C C
charge: -0.124319 -0.117618 -0.093131 -0.321256 -0.312429 -0.252283 -0.248494 0.136991 0.135633 0.139209 0.169958 0.199813 0.208553 0.212262 0.230694 0.215618 -0.068502 -0.074651 -0.072082 -0.042364 0.021324 0.008489 0.020777 0.004530 0.020031 0.003248
polarizability: 2.91220280e+02 2.28795841e+01 2.75570730e+02 4.56757514e+00 -1.31896611e+00 1.24029982e+02
1716.lowfreq: -7.0726 -1.2765 -0.0007 -0.0005 -0.0004 4.3969 10.1099 19.0173 30.1024
frequency: 9.1033 18.9218 30.0688 35.9399 42.1382 50.1706 63.3412 73.8714 77.3747 94.4678 107.0531 124.4210 156.7569 170.3049 175.4284 207.1821 220.8714 236.0276 262.7172 283.6280 305.9184 317.0484 348.0633 372.0002 402.7950 405.0247 410.4701 421.5517 433.3272 443.8072 451.5676 475.2752 509.5486 512.0091 522.4726 532.8170 547.1901 613.0796 613.6450 656.0588 662.6808 676.8630 679.9615 681.7689 700.3996 706.6236 770.1113 795.4226 795.8315 797.3454 833.1747 864.2064 869.1321 873.2097 912.0704 925.2614 937.3775 955.4714 961.0002 986.8045 990.5213 990.8846 996.1102 1002.1800 1010.2237 1010.7460 1014.3397 1016.6615 1021.2541 1041.6560 1050.5438 1067.8560 1077.4746 1083.7808 1087.8977 1089.2176 1100.6610 1170.5399 1175.2324 1176.1707 1180.7836 1183.1542 1207.0728 1232.3453 1242.1585 1244.2031 1248.8736 1256.3091 1296.2020 1308.9134 1311.9688 1315.9952 1326.9456 1331.5906 1344.5263 1383.6995 1390.2203 1390.7909 1395.2311 1414.8779 1435.9138 1438.4333 1454.0025 1470.4019 1475.6869 1477.4794 1583.9178 1585.0478 1609.3295 1610.7198 1623.4176 1627.3018 2963.1102 2982.9154 3025.9151 3028.5151 3042.1720 3097.3097 3122.1836 3129.7861 3134.7259 3145.7186 3146.3107 3158.0774 3159.5078 3168.6360 3169.4396 3179.3927 3198.7906 3487.6224 3511.6557 3546.2926
redmass: 5.3395 5.7572 4.7216 5.4697 6.2319 5.8943 5.5679 5.7117 7.8997 6.4261 7.1723 5.2587 4.2830 4.3338 5.2642 4.5074 5.6085 5.8069 6.6083 4.2447 4.8433 5.7304 3.8651 4.8443 2.8222 2.8573 1.7894 5.9888 3.2987 3.4403 2.6120 2.5499 3.7103 1.2939 3.4939 1.2484 4.1974 6.4343 6.4406 6.6674 6.1376 4.5589 4.0331 5.1282 1.6121 1.6465 5.5382 2.4926 2.8091 3.1073 3.3628 1.2462 2.5928 1.2547 5.7436 5.6404 2.5868 1.4160 1.4022 4.1227 5.9937 6.2128 1.4007 1.3734 2.9759 1.5837 2.3947 1.5255 2.8740 2.6168 3.2260 2.2135 2.4517 1.9162 1.8376 1.8213 2.7120 1.0560 1.1364 1.0575 1.1276 1.1372 1.2136 1.6367 1.8962 2.6870 1.1521 1.2078 1.2456 1.2139 1.3194 1.3198 1.2483 1.3144 1.3246 1.4930 9.8420 9.5886 1.5404 1.8513 2.2618 2.2336 1.1049 1.0972 2.2285 2.2455 6.7091 6.5118 6.3018 6.0544 10.5542 10.1357 1.0828 1.0854 1.0582 1.0858 1.0563 1.1074 1.1088 1.0859 1.0857 1.0899 1.0890 1.0936 1.0941 1.0992 1.0973 1.0989 1.0944 1.0647 1.0646 1.0654
irintensity: 0.4367 0.4538 0.1958 0.6085 0.2537 0.2783 1.8775 1.3740 2.9002 1.8778 2.1067 2.0063 0.8987 3.9342 0.3683 4.1159 1.4855 2.6515 14.4622 26.1953 14.7978 9.0220 8.1689 0.3560 0.0006 0.0749 26.9570 7.1808 13.0951 2.5749 23.9185 15.7942 51.7121 320.5088 44.2446 48.1776 16.3093 0.1171 1.4148 1.8462 8.3885 11.4634 15.4662 11.3699 68.0660 123.3234 14.4175 21.0086 32.2242 16.5409 10.8884 0.2774 16.1689 2.6505 8.0551 64.8791 11.6240 3.4801 6.8291 69.3143 6.5799 0.6366 0.0669 0.4947 192.9239 54.6367 87.9369 21.0356 33.0236 66.0736 264.5884 38.8536 12.8113 11.2171 21.1953 39.3143 16.0691 3.2844 33.4420 0.2321 17.4483 51.9580 58.0270 38.3301 116.4616 411.6045 30.4177 6.1923 15.6220 9.1231 9.1262 1.9779 3.4636 30.1155 95.4389 21.9590 6.7755 3.6594 7.5470 44.8408 28.8855 16.2223 25.0859 11.8431 4.9854 5.6228 49.6162 31.8177 35.1939 16.4544 246.8809 159.9898 21.0654 64.9367 17.2678 27.7274 14.4701 15.9090 5.8513 1.7277 0.1285 12.3596 7.6349 15.4138 17.4682 20.7527 21.2061 9.7614 3.2190 52.9199 31.9467 26.1573
temp: 298.150 k
press: 1.00000 atm
elementType: 8 8 8 8 8 8 8 6 6 6 6 6 6 6 6 6 6 6 6 6 6 6 6 6 6 6 1 1 1 1 1 1 1 1 1 1 1 1 1 1 1 1 1 1 1 1
symmnumber: 1
zpe: 939593.2 jmol-1
zpe.correction: 0.357872 hartree
zpe.thermalcorrener: 0.382509 hartree
zpe.thermalcorrenthalpy: 0.383453 hartree
zpe.thermalcorrgfe: 0.299357 hartree
zpe.sumelectzpe: -1260.675795 hartree
zpe.sumelectthermal: -1260.651158 hartree
zpe.sumelectthermalent: -1260.650214 hartree
zpe.sumelectthermalfe: -1260.734310 hartree
dipole: 7.6227 1.1862 0.8051
dipole: 7.7563
quadrupole: -148.4987 -139.2853 -157.1323
quadrupole: -4.3935 2.1661 -0.5617
quadrupole: -0.1933 9.0201 -8.8269 -4.3935 2.1661 -0.5617
hfenergy: -1261.0336674 hartree
pointgroup: C01 [X(C19H20O7)]
dipole: 2.4979619 1.4973049 -0.9112213 debye
polarizability: 306.5829943|7.5272095|235.9888224|-0.0188529|-52.1971142|148.2491745 unknown
InChI: InChI=1S/C19H20O7/c20-15(11-25-18(23)13-7-3-1-4-8-13)17(22)16(21)12-26-19(24)14-9-5-2-6-10-14/h1-10,15-17,20-22H,11-12H2
charge 0 multiplicity 1
46 atoms
O  -3.962772 1.985561 -1.019061
O  -1.736502 1.512876 -2.429911
O  -5.234566 0.342079 0.591339
O  0.158843 2.195235 -0.599855
O  -2.174867 -1.671261 0.831909
O  1.38235 0.833785 0.851742
O  -2.765669 -3.915873 1.018241
C  -3.325622 0.65963 -0.897867
C  -1.807117 0.825761 -1.119871
C  -3.78874 0.127957 0.477913
C  -1.129535 1.68599 -0.03798
C  -3.62394 -1.381992 0.660244
C  1.358296 1.706263 -0.04941
C  -1.873632 -3.032821 1.037197
C  2.554615 2.345708 -0.66323
C  -0.423134 -3.276683 1.266657
C  3.834833 1.868253 -0.276307
C  0.005373 -4.625471 1.394151
C  2.448306 3.405878 -1.601725
C  0.519423 -2.221919 1.370255
C  4.997701 2.441647 -0.82835
C  1.366072 -4.914503 1.618475
C  3.615375 3.977421 -2.149778
C  1.880746 -2.51707 1.595828
C  4.890093 3.496066 -1.766805
C  2.307071 -3.860384 1.719585
H  -3.713535 -0.006983 -1.696654
H  -1.315435 -0.163081 -1.179798
H  -3.261118 0.668283 1.292074
H  -1.723173 2.588595 0.179734
H  -0.925257 1.106442 0.876994
H  -4.017447 -1.942304 -0.206236
H  -4.17279 -1.707949 1.560031
H  -3.596223 2.39277 -1.849298
H  -0.821049 1.881887 -2.529666
H  -5.420026 1.219875 0.158104
H  3.894759 1.054553 0.453772
H  -0.740892 -5.423044 1.31609
H  1.459678 3.779876 -1.881803
H  0.2027 -1.18101 1.2817
H  5.984138 2.071344 -0.530192
H  1.694471 -5.954959 1.715592
H  3.534108 4.797458 -2.871039
H  2.596972 -1.692921 1.674893
H  5.794512 3.942103 -2.195086
H  3.364905 -4.08676 1.895901
