program: Gaussian 09
title: 000220187
version: EM64L-G09RevD.01
frameworkgroup: C1[X(C5H8BrNO2S)]
method: RPBEPBE
basis: SDD
operation: Freq
keyword: #p
keyword: freq=noraman
keyword: PBEPBE/SDD
title: #p freq=noraman PBEPBE/SDD
converged: YES YES NO NO
title: Mulliken charges:
elementType: Br S O O N C C C C C H H H H H H H H
charge: 0.000666 0.127266 -0.227680 -0.153888 -0.601437 -0.534442 -0.637350 0.318953 0.031353 -0.702058 0.314555 0.289494 0.339954 0.241339 0.264528 0.254271 0.332173 0.342302
chargesum: 0.00000
title: Mulliken charges with hydrogens summed into heavy atoms:
elementType: Br S O O N C C C C C
charge: 0.000666 0.127266 -0.227680 -0.153888 0.073038 -0.219887 -0.007902 0.318953 0.031353 0.058081
polarizability: 1.52951912e+02 -1.17230310e+01 7.84203215e+01 -4.75277333e+00 -4.36097472e+00 8.16892883e+01
1716.lowfreq: -6.1595 -0.0009 0.0013 0.0014 3.2590 8.1445 36.5029 43.8922 48.5415
frequency: 36.4177 43.8525 48.4934 82.4886 101.8275 133.9742 151.7668 206.2549 212.0449 268.0227 351.6484 438.7653 459.6169 461.9967 498.3490 511.0776 570.0315 580.3176 614.8077 673.5392 747.0851 766.6518 931.4089 960.2958 1011.5416 1058.6884 1086.3318 1109.3053 1147.4532 1175.3890 1259.6098 1287.1178 1366.9661 1374.7684 1437.9411 1444.3040 1454.6673 1597.6241 1652.4337 1671.3862 2995.1395 3033.2547 3068.0842 3090.0174 3121.8904 3130.8240 3517.8419 3669.8835
redmass: 5.6267 4.5624 7.0158 5.2073 1.0872 9.5986 7.4914 7.3386 6.7012 2.8030 3.8305 4.8386 4.1009 2.4122 3.3510 1.3676 4.0354 2.7887 1.7909 5.9146 5.0779 2.8266 1.7387 2.4364 1.5519 2.0781 2.1208 2.2676 1.2358 1.2283 1.2984 1.4781 2.5422 1.2024 1.0942 1.0515 1.0593 1.4426 3.6058 9.9245 1.0361 1.0610 1.0864 1.0959 1.1022 1.1052 1.0451 1.1044
irintensity: 8.1597 2.4375 4.9323 1.9277 0.4169 0.2885 2.0952 6.7726 10.8048 11.4630 3.1584 2.8081 31.4365 12.2167 5.1901 85.7905 81.4826 22.9745 255.8293 7.9936 6.0347 3.9523 1.0612 64.3592 7.1181 0.1312 12.8496 178.2168 12.6555 3.9676 15.5305 49.3608 81.8206 44.5008 32.0375 18.7448 22.1648 44.3976 215.2877 247.9803 1.1863 12.6891 4.2992 7.6462 9.2369 2.4135 44.5964 32.7279
temp: 298.150 k
press: 1.00000 atm
elementType: 35 16 8 8 7 6 6 6 6 6 1 1 1 1 1 1 1 1
symmnumber: 1
zpe: 338622.1 jmol-1
zpe.correction: 0.128974 hartree
zpe.thermalcorrener: 0.141428 hartree
zpe.thermalcorrenthalpy: 0.142372 hartree
zpe.thermalcorrgfe: 0.087423 hartree
zpe.sumelectzpe: -811.289784 hartree
zpe.sumelectthermal: -811.277330 hartree
zpe.sumelectthermalent: -811.276386 hartree
zpe.sumelectthermalfe: -811.331335 hartree
dipole: 0.4481 2.1207 -3.7664
dipole: 4.3456
quadrupole: -65.2489 -68.8221 -81.8419
quadrupole: 4.3444 0.7607 -3.0881
quadrupole: 6.7220 3.1489 -9.8709 4.3444 0.7607 -3.0881
hfenergy: -811.4187584 hartree
pointgroup: C01 [X(C5H8Br1N1O2S1)]
dipole: -0.4009522 0.9662677 1.3522592 debye
dipolederiv: -0.6704565 -0.2610181 -0.0309491 -0.2741574 -0.3481173 -0.003021 -0.1133239 -0.0382059 -0.1300206 -0.7858777 -0.1869283 0.3095157 -0.1225733 -0.1764192 0.1230466 0.5479081 0.1620276 -0.4740003 -0.7210501 0.1808992 0.186911 -0.013897 -0.5186666 0.1672023 0.3361321 0.0734703 -0.6151897 -0.4429154 -0.1321915 0.012036 0.0219614 -0.3750803 -0.3344333 0.4819185 -0.0560574 -1.0297532 -0.8351471 0.2803593 0.0508477 0.3966104 -0.7571733 -0.3457262 0.0011688 -0.2532481 -0.504642 0.9054168 0.3794349 0.1419067 0.32088 0.1468752 0.1369683 0.188685 0.2246811 0.1309887 0.2200444 0.1003961 0.0329728 0.0043632 0.0550862 -0.0589673 0.1041433 0.0156284 -0.0746836 1.0057832 -0.572298 -0.4912899 -0.3786545 0.9796399 -0.034616 -0.5826558 -0.1512131 0.6303852 0.9345543 0.4491627 -0.3915701 0.3751324 0.4836804 0.180881 -1.1733763 -0.160082 1.3723562 -0.2219273 -0.2141116 0.0034045 -0.3311375 -0.2557805 -0.0289055 0.1285337 0.0453131 -0.0042569 -0.0171748 -0.0390996 -0.0260853 -0.0313032 -0.0101795 -0.0623546 0.0123963 -0.0146853 -0.0466601 -0.0096895 -0.0528721 -0.0095125 -0.020514 -0.0458457 0.0443741 -0.0495008 0.0477241 0.080594 0.0765508 -0.0118523 -0.0007102 -0.0430428 0.1161786 0.0098239 -0.0533712 -0.063516 0.0576717 0.1087278 -0.0184047 0.003452 0.0242099 0.134553 0.0374719 -0.0540771 0.0015573 -0.0744757 0.0461443 0.0521778 -0.0224337 0.0344331 -0.0056391 0.0357945 -0.0162593 0.0372626 0.11457 -0.0549243 -0.0225696 0.0769029 0.0168346 0.1017441 -0.0386452 0.1051545 -0.043043 0.0522069 0.2294268 0.0138929 0.0812629 -0.0091171 0.2367416 0.0908482 0.0582645 0.0983605 0.2662963 0.2325142 0.0550227 0.0733385 0.0299718 0.2384024 0.0802583 0.0782596 0.0740258 0.2486131 unknown
polarizability: 140.620228|28.810803|91.3416628|-10.4234553|1.2898164|81.0996312 unknown
InChI: InChI=1S/C5H8BrNO2S/c1-3(8)10-2-4(6)5(7)9/h4H,2,7H2,1H3
charge 0 multiplicity 1
18 atoms
Br -2.831695 -1.762894 0.217218
S  1.439061 -0.230761 1.286778
O  -0.650279 1.111128 -0.994997
O  2.255407 -0.51081 -1.336078
N  -2.474969 1.625171 0.349307
C  -1.287256 -0.496407 0.757666
C  0.027084 -1.228249 0.512201
C  -1.43617 0.808936 -0.05461
C  2.47943 0.064792 -0.258216
C  3.580708 1.072727 -0.006438
H  -1.483817 -0.332424 1.830449
H  0.023305 -2.223679 0.978142
H  0.262994 -1.299298 -0.56432
H  3.887754 1.092497 1.05208
H  3.200292 2.076809 -0.273104
H  4.446545 0.850257 -0.651266
H  -3.153922 1.332196 1.050569
H  -2.637973 2.489008 -0.167384
