program: Gaussian 09
title: 000220174
version: EM64L-G09RevD.01
frameworkgroup: C1[X(C10H10N2S)]
method: RPBEPBE
basis: SDD
operation: Freq
keyword: #p
keyword: freq=noraman
keyword: PBEPBE/SDD
title: #p freq=noraman PBEPBE/SDD
converged: YES YES NO NO
title: Mulliken charges:
elementType: S N N C C C C C C C C C C H H H H H H H H H H
charge: 0.227913 -0.062606 -0.567414 0.248462 0.311551 0.312940 -0.387864 -0.416251 -0.808260 -0.249370 -0.231454 -0.726331 -0.216554 0.244154 0.227726 0.259584 0.212782 0.227971 0.226082 0.225444 0.280278 0.327900 0.333317
chargesum: 0.00000
title: Mulliken charges with hydrogens summed into heavy atoms:
elementType: S N N C C C C C C C C C C
charge: 0.227913 -0.062606 0.093803 0.248462 0.311551 0.312940 -0.143710 -0.188525 -0.107923 -0.023288 -0.006011 -0.446052 -0.216554
polarizability: 2.05760628e+02 2.42847672e+00 1.40174210e+02 3.12277603e+00 -4.00761434e+00 7.03114634e+01
1716.lowfreq: -8.4906 -6.1824 -0.0013 0.0012 0.0017 2.6508 40.8308 82.6696 102.8631
frequency: 40.7925 82.6645 102.8587 131.2090 187.3498 238.0634 262.2787 281.4679 290.2673 298.7947 369.0448 398.5238 427.6696 458.5374 517.1107 536.9479 552.0364 568.5536 589.3598 647.1267 671.0671 716.5943 737.9268 754.4269 775.7496 806.4010 874.4663 877.8107 949.3670 984.5399 986.7315 992.4523 1049.0049 1050.4514 1090.6741 1124.6575 1173.2780 1181.6024 1215.9012 1260.6703 1277.9362 1322.8118 1365.2234 1401.8534 1431.8157 1455.3762 1458.9432 1477.5835 1516.6157 1576.4766 1581.1777 1611.1349 1628.9310 2984.7748 3068.9132 3089.6258 3118.0695 3128.0297 3141.5874 3160.8304 3246.2448 3561.2999 3712.3283
redmass: 4.4724 5.3460 4.0621 1.1401 2.8930 5.4488 4.5513 1.4854 3.5509 2.6999 4.1657 1.2394 3.0772 3.1134 3.9894 5.5554 8.3848 4.7179 4.3561 6.5963 3.8247 1.5733 1.7838 3.6268 2.1355 4.3453 1.3360 6.4084 1.3934 1.9973 1.5788 1.6131 1.5656 2.0890 1.8689 1.5335 1.0877 1.9191 2.2295 2.9435 1.7270 3.4808 7.6154 1.2435 2.1563 1.0740 3.0540 1.1373 5.3252 2.1710 5.2020 5.2935 2.1902 1.0368 1.0964 1.1001 1.0857 1.0883 1.0941 1.1010 1.0958 1.0450 1.1047
irintensity: 0.1835 2.1746 0.9564 1.7214 3.7135 2.7001 2.5366 53.2974 7.6496 24.5154 4.8463 233.8276 7.3697 7.3050 0.8247 5.3250 4.2637 10.5675 5.7564 14.7215 3.1753 43.7987 56.9949 37.2737 22.7642 4.0387 0.5377 13.3369 1.4222 11.7099 5.5530 1.5038 10.2689 8.4435 2.0389 12.3131 1.2792 2.4755 0.7919 85.7921 5.3654 45.7177 0.2113 15.4209 10.6353 20.9301 14.0669 37.7604 8.2311 59.2606 4.3857 13.8040 459.9283 27.4527 18.9472 22.1276 8.2777 5.7408 35.6137 32.2814 4.1802 107.4589 46.5343
temp: 298.150 k
press: 1.00000 atm
elementType: 16 7 7 6 6 6 6 6 6 6 6 6 6 1 1 1 1 1 1 1 1 1 1
symmnumber: 1
zpe: 463983.7 jmol-1
zpe.correction: 0.176722 hartree
zpe.thermalcorrener: 0.188822 hartree
zpe.thermalcorrenthalpy: 0.189766 hartree
zpe.thermalcorrgfe: 0.138231 hartree
zpe.sumelectzpe: -893.704714 hartree
zpe.sumelectthermal: -893.692614 hartree
zpe.sumelectthermalent: -893.691670 hartree
zpe.sumelectthermalfe: -893.743205 hartree
dipole: 2.1863 0.9084 -0.2275
dipole: 2.3784
quadrupole: -64.5701 -75.3372 -87.7179
quadrupole: 7.1316 -3.5974 -1.2528
quadrupole: 11.3050 0.5379 -11.8428 7.1316 -3.5974 -1.2528
hfenergy: -893.8814359 hartree
pointgroup: C01 [X(C10H10N2S1)]
dipole: 0.8804103 -0.2239288 0.2242935 debye
dipolederiv: -0.4863916 -0.1683326 0.2333487 -0.0469412 -0.0797965 0.2538589 -0.0584108 0.2354749 -0.290513 -1.323766 0.0602999 -0.1535464 -0.1488934 -0.319599 0.1420661 0.1107913 0.1582484 -0.4684289 -1.108341 0.2996552 -0.4967859 0.4258537 -0.7069956 0.0187232 -0.6762659 0.0103761 -0.748912 0.2449754 0.0355369 -0.0710755 0.0552415 -0.0871204 0.03217 -0.0854182 0.0214651 -0.025473 -0.0166991 -0.2188902 0.0648028 -0.1291541 0.2500861 -0.047427 0.0498578 -0.0641463 -0.0082704 0.587144 -0.0278891 0.0637873 -0.1319465 0.1075066 -0.1435665 0.2153581 -0.1212448 0.2902762 -0.0658461 0.0399608 0.0057566 0.0046352 0.0116616 -0.02396 0.0212689 -0.0405665 -0.1456215 -0.0551435 0.187327 -0.0614433 0.0887221 -0.0193259 -0.0611339 -0.0230376 -0.065406 -0.1561262 -0.0395825 0.1729276 -0.0471066 0.0992287 -0.0582535 0.0277313 -0.0154534 0.0567275 0.0075917 -0.0686223 -0.0838025 0.0192326 -0.108787 0.0215413 -0.046583 -0.0034187 -0.0448396 -0.1547072 0.04097 -0.0089157 -0.0121288 0.0256521 -0.006244 -0.0495612 -0.0240912 -0.0387705 -0.138442 0.3035322 0.0633774 -0.0598878 0.0897122 -0.3199657 -0.0428113 -0.0026466 -0.0443131 -0.2546955 1.537349 -0.2035521 0.3923169 -0.1581118 0.4094023 -0.5209195 0.3704253 -0.5071309 0.8919252 0.0478136 -0.0997433 0.0328268 -0.0794603 -0.0350825 0.0408992 0.0186665 0.0581559 0.1233287 0.0254132 -0.0632673 0.0307907 -0.1104984 -0.0768481 0.0744693 0.0394647 0.0682293 0.1263044 0.0703457 0.045675 -0.1078317 0.0386366 0.067438 -0.0258009 -0.1212573 0.009052 -0.002644 -0.0649497 -0.1880995 0.0517614 -0.0832079 -0.0738141 0.0401626 0.0160831 0.0306636 0.1012143 0.0381762 0.0756318 0.0912153 0.075492 0.0373534 -0.0047028 0.1052457 -0.0596701 -0.0375627 0.003575 0.0880911 -0.0104136 0.1167947 -0.062901 0.0530384 -0.0211019 0.0525448 0.1480431 -0.1535902 0.0081336 0.026014 0.0001497 0.0917658 0.0180503 0.0297895 0.0211811 0.1504109 0.0389792 0.0297249 -0.0471099 0.0450332 0.1814728 0.0669289 -0.0398989 0.0708368 0.0959387 0.2724527 -0.0317873 0.044847 -0.0237377 0.3257055 0.117663 0.0345276 0.1155518 0.2216133 0.1722058 -0.0120615 0.0106295 -0.0444135 0.342013 0.0807047 0.0595221 0.0775806 0.27475 unknown
polarizability: 205.6937923|-1.5926453|117.5440057|-5.0029477|-32.8719044|93.0085029 unknown
InChI: InChI=1S/C10H10N2S/c1-7-4-2-3-5-8(7)9-6-13-10(11)12-9/h2-6H,11H2,1H3
charge 0 multiplicity 1
23 atoms
S  3.158799 0.91196 -1.20864
N  1.599263 -0.306383 0.609955
N  3.937728 -0.548619 1.063538
C  -0.745975 0.233794 -0.163064
C  -1.420608 -0.961327 0.246425
C  0.7296 0.30103 -0.326839
C  -1.507001 1.403651 -0.438278
C  -2.833279 -0.927658 0.364874
C  -0.681553 -2.257184 0.528174
C  -2.912183 1.412278 -0.324266
C  -3.581317 0.237627 0.085063
C  1.36065 0.982894 -1.358509
C  2.871023 -0.094348 0.321744
H  -0.978031 2.322306 -0.716374
H  -3.354123 -1.84134 0.676204
H  -0.01496 -2.151042 1.400972
H  -1.393317 -3.079935 0.714925
H  -0.032371 -2.543783 -0.319773
H  -3.475102 2.32776 -0.537166
H  -4.672301 0.227562 0.187874
H  0.91355 1.483355 -2.213865
H  4.898196 -0.357573 0.797156
H  3.742111 -1.077123 1.910474
