program: Gaussian 09
title: 000220171
version: EM64L-G09RevD.01
frameworkgroup: C1[X(C15H13NO4)]
method: RPBEPBE
basis: SDD
operation: Freq
keyword: #p
keyword: freq=noraman
keyword: PBEPBE/SDD
title: #p freq=noraman PBEPBE/SDD
converged: YES YES NO NO
title: Mulliken charges:
elementType: O O O O N C C C C C C C C C C C C C C C H H H H H H H H H H H H H
charge: -0.307075 -0.265638 -0.443213 -0.258341 -0.459382 0.473256 -0.420471 0.491893 -0.438718 -0.344375 0.264329 -0.383837 -0.383877 -0.335833 -0.321630 -0.224057 -0.224054 0.269180 -0.229877 0.104697 0.236136 0.236126 0.230277 0.303777 0.235493 0.235488 0.271973 0.274377 0.336890 0.230409 0.230410 0.232599 0.383065
chargesum: 0.00000
title: Mulliken charges with hydrogens summed into heavy atoms:
elementType: O O O O N C C C C C C C C C C C C C C C
charge: -0.307075 -0.265638 -0.060148 -0.258341 -0.122492 0.473256 0.051791 0.491893 -0.208441 -0.040598 0.264329 -0.148344 -0.148388 -0.063860 -0.047253 0.006353 0.006356 0.269180 0.002723 0.104697
polarizability: 3.23787603e+02 -1.31547896e+01 1.52393465e+02 -2.46109839e-02 -4.29017305e-03 1.17292051e+02
1716.lowfreq: -13.5416 -4.3744 -4.0614 0.0003 0.0007 0.0009 9.1571 13.8743 36.7040
frequency: -10.8760 13.2305 36.7028 37.8829 59.8259 85.7612 92.7404 103.2347 161.5098 173.2015 190.3731 244.5521 298.5580 300.4936 321.0892 350.3263 402.9581 413.0958 419.1979 485.0871 503.8243 506.4409 560.0052 587.1401 590.9686 617.4707 627.5089 652.4117 687.3004 694.7176 704.6909 704.6937 729.7052 760.3685 763.1799 827.8405 835.9504 842.5083 854.3498 877.3689 893.8395 934.9082 949.2085 978.3252 981.8872 984.6451 991.1522 997.6766 998.6889 1004.8573 1021.9503 1027.4702 1089.0849 1125.8642 1152.2571 1153.4522 1173.9206 1188.4998 1193.1597 1197.4331 1228.9435 1267.0020 1312.6957 1324.2294 1326.1900 1350.2721 1381.3632 1386.6773 1427.7014 1440.9134 1475.1504 1487.6935 1494.0652 1517.5511 1586.7797 1596.9367 1617.6627 1622.5737 1640.5585 1662.0972 3014.9910 3079.5875 3123.1564 3124.1354 3124.7606 3137.1741 3150.2496 3164.2835 3166.2480 3170.7909 3193.6653 3532.9005 3535.4940
redmass: 4.2726 4.4906 6.4374 5.9642 11.3501 5.6448 6.4825 5.6795 6.2026 7.3859 6.1126 8.2235 4.9527 6.4174 2.2272 6.6540 2.7961 2.9610 5.8360 5.7269 2.6651 4.3993 5.2212 1.2189 5.0887 6.3373 7.0332 1.4257 3.6452 4.3325 2.3479 3.7655 3.3292 4.4788 2.4484 4.9605 4.2560 1.3830 1.2467 1.5255 4.2397 1.7374 1.6171 1.3925 1.3657 10.3034 6.2139 4.5545 1.3305 1.3360 2.7924 2.1863 1.5130 1.3372 2.3174 2.0686 1.0537 1.1207 1.0894 1.1834 2.3724 1.9640 1.4342 2.9856 1.2734 1.4623 4.4070 8.7746 4.3393 2.1956 1.1071 2.3925 2.0730 3.1929 5.0756 6.1482 6.1936 6.0316 8.5215 8.3247 1.0576 1.1081 1.0856 1.0898 1.0885 1.0918 1.0963 1.0951 1.1017 1.0904 1.0960 1.0642 1.0761
irintensity: 0.0319 0.1698 0.0238 0.1386 5.4164 0.0151 0.3924 0.7817 5.0553 6.0528 0.5006 13.9592 0.1313 0.3551 1.2033 2.5519 0.0009 0.4615 28.5169 12.3027 59.1390 3.4321 5.0125 74.2628 55.5252 0.1016 0.3549 24.3917 82.3894 14.5002 38.5395 41.5862 34.7885 26.1457 52.0945 1.8553 45.6927 28.2854 0.0739 56.7933 13.3026 2.5808 1.8319 0.0015 0.2161 478.9976 0.5146 133.1661 0.1970 0.4625 305.5390 0.5480 7.4167 32.3637 809.3645 60.2353 0.0014 1.9138 1.1488 7.6999 11.5421 0.7819 81.9622 148.7542 0.2442 65.6820 101.2765 0.4917 31.3480 9.5491 25.8801 8.4887 277.5220 597.3254 28.3469 0.6960 1.0116 346.1994 293.4912 170.1156 21.5766 12.2553 5.8124 12.9066 2.6220 13.4504 37.4958 3.7885 21.5676 0.7748 2.1894 56.3296 32.6720
temp: 298.150 k
press: 1.00000 atm
elementType: 8 8 8 8 7 6 6 6 6 6 6 6 6 6 6 6 6 6 6 6 1 1 1 1 1 1 1 1 1 1 1 1 1
symmnumber: 1
zpe: 656875.7 jmol-1
zpe.correction: 0.250191 hartree
zpe.thermalcorrener: 0.266965 hartree
zpe.thermalcorrenthalpy: 0.267909 hartree
zpe.thermalcorrgfe: 0.202733 hartree
zpe.sumelectzpe: -933.661113 hartree
zpe.sumelectthermal: -933.644338 hartree
zpe.sumelectthermalent: -933.643394 hartree
zpe.sumelectthermalfe: -933.708571 hartree
dipole: 4.2255 -0.8175 -0.0004
dipole: 4.3038
quadrupole: -108.8565 -117.6436 -111.2831
quadrupole: -14.4233 -0.0057 -0.0035
quadrupole: 3.7379 -5.0492 1.3113 -14.4233 -0.0057 -0.0035
hfenergy: -933.9113036 hartree
pointgroup: C01 [X(C15H13N1O4)]
dipole: 1.6608223 -0.3298667 0.0000697 debye
polarizability: 323.6530623|-14.0032207|152.5279679|-0.0189208|-0.0357285|117.2920887 unknown
InChI: InChI=1S/C15H13NO4/c17-14(18)12-6-8-13(9-7-12)16-15(19)20-10-11-4-2-1-3-5-11/h1-9,16-17H,10H2
charge 0 multiplicity 1
33 atoms
O  1.863269 0.187117 -0.000475
O  0.336036 1.983695 -0.001434
O  -6.649224 1.031117 0.000046
O  -6.777252 -1.288391 0.001423
N  -0.339829 -0.295898 -0.000311
C  4.281711 0.413315 -0.00012
C  2.986901 1.186215 -0.000629
C  -1.751779 -0.215599 -0.000074
C  -2.47549 -1.442756 0.000789
C  -2.456535 1.020226 -0.000679
C  -4.587741 -0.206658 0.000434
C  4.899081 0.045703 1.222027
C  4.899655 0.04508 -1.221788
C  -3.87727 -1.436578 0.001034
C  -3.862578 1.012843 -0.000418
C  6.110551 -0.680609 1.224542
C  6.111127 -0.681234 -1.223368
C  0.57532 0.751608 -0.001139
C  6.718967 -1.045541 0.000823
C  -6.067518 -0.250885 0.000719
H  2.872634 1.821638 0.895271
H  2.872954 1.820983 -0.897033
H  -1.93281 -2.396126 0.001257
H  -1.899167 1.958688 -0.001351
H  4.428897 0.329108 2.171512
H  4.429917 0.3280 -2.171638
H  -4.444599 -2.372763 0.001692
H  -4.413299 1.957567 -0.000882
H  0.081198 -1.228198 0.00018
H  6.580348 -0.957839 2.174579
H  6.581368 -0.958948 -2.173043
H  7.660524 -1.606045 0.001188
H  -7.638165 0.926366 0.000263
