program: Gaussian 09
title: 000217606
version: EM64L-G09RevD.01
frameworkgroup: C1[X(C22H26ClN3O3)]
method: RPBEPBE
basis: SDD
operation: Freq
keyword: #p
keyword: freq=noraman
keyword: PBEPBE/SDD
title: #p freq=noraman PBEPBE/SDD
converged: YES YES NO NO
title: Mulliken charges:
elementType: Cl O O O N N N C C C C C C C C C C C C C C C C C C C C C C H H H H H H H H H H H H H H H H H H H H H H H H H H
charge: -0.057949 -0.312479 -0.314093 -0.317585 -0.253256 -0.316942 -0.362659 -0.364364 -0.372887 -0.372268 -0.351810 -0.521246 -0.355996 -0.658125 0.367827 0.391164 0.260250 0.202180 0.188954 -0.695596 0.271059 -0.383212 -0.261113 -0.359300 -0.352864 -0.262529 -0.131119 -0.212897 -0.232391 0.189631 0.190989 0.193483 0.191261 0.236230 0.203687 0.188227 0.187699 0.213013 0.232886 0.195988 0.195262 0.271446 0.276785 0.209685 0.215991 0.209893 0.247258 0.302433 0.351133 0.375117 0.261824 0.264347 0.239802 0.236816 0.260359
chargesum: 0.00000
title: Mulliken charges with hydrogens summed into heavy atoms:
elementType: Cl O O O N N N C C C C C C C C C C C C C C C C C C C C C C
charge: -0.057949 -0.312479 -0.314093 -0.317585 -0.253256 0.034191 0.012458 0.016256 0.011858 0.067649 0.024116 -0.075348 0.035254 -0.109894 0.367827 0.391164 0.260250 0.202180 0.188954 -0.060026 0.271059 -0.135954 0.041320 -0.097476 -0.088517 -0.022727 -0.131119 0.023919 0.027968
polarizability: 3.88521233e+02 -4.44500651e+01 3.29616620e+02 -1.81644824e+01 -8.28459930e+00 1.70726523e+02
1716.lowfreq: -4.7805 -2.4903 -0.0018 -0.0013 -0.0005 3.8576 5.6021 16.6107 25.9927
frequency: 4.8669 16.5477 25.9440 28.8708 33.4088 42.2911 53.3937 56.6115 83.5079 84.9959 89.8470 93.2690 104.5067 123.3659 127.6953 136.6324 148.8556 155.5554 168.7967 226.7753 228.7194 233.6489 245.2990 260.7595 291.7850 295.0443 301.8409 319.8172 323.4808 342.9049 360.8131 409.2905 416.6501 429.7893 441.8105 451.4559 469.1587 472.1650 516.8125 538.2187 550.0008 556.5366 569.2395 603.1409 615.3752 632.7367 637.6450 670.9718 689.1877 697.4113 708.4231 720.6130 721.5391 731.6847 748.3073 762.5685 767.3915 787.1477 811.0024 823.3743 827.0811 865.3090 868.7700 881.6457 889.4783 906.6889 914.4542 942.8214 945.9626 974.1894 985.6402 990.8531 998.4021 999.7559 1028.3324 1035.7062 1047.8715 1073.9339 1077.0157 1079.8505 1083.9940 1090.1049 1112.4897 1114.7782 1118.2051 1158.5352 1161.4526 1171.4682 1185.9325 1191.6006 1197.7375 1223.1257 1224.5882 1232.4913 1242.4435 1254.9576 1262.1224 1268.5095 1276.7100 1281.3187 1283.4108 1293.0772 1295.6978 1311.9405 1336.0031 1342.3956 1348.9558 1355.5468 1356.4129 1375.9875 1387.1820 1390.2127 1404.5282 1418.4173 1442.0045 1446.2314 1463.2247 1463.6661 1469.8224 1472.4965 1475.8980 1476.6751 1477.3213 1484.7273 1485.8470 1489.2593 1528.3454 1557.8570 1571.2827 1590.7515 1597.7868 1607.5874 1616.6001 2951.5458 2952.2636 2960.2322 2968.9444 2972.1136 2975.1898 2984.6985 2987.4045 2996.8663 3009.5071 3015.4828 3027.8800 3035.9750 3060.9024 3068.2080 3070.6454 3071.3306 3112.3930 3143.6166 3163.5985 3163.9680 3176.7840 3183.5354 3200.3548 3466.5488 3511.8458
redmass: 5.0834 5.6528 5.3847 5.0191 2.1612 5.0735 2.9779 4.2658 6.3816 2.6037 4.1473 3.7646 5.4573 2.6524 4.8742 2.1984 4.0429 4.5800 4.7171 1.2097 3.9489 5.3339 6.9748 6.3798 7.4612 5.4399 4.5954 5.5279 5.3004 6.0091 3.3008 3.3135 4.3857 4.2940 3.7107 3.5345 2.9940 3.2456 3.7845 1.6206 2.8082 1.7785 3.4538 4.6622 3.2559 6.5193 5.1330 5.4767 6.6491 4.0083 4.9660 2.4178 1.2315 1.1477 4.2861 1.2045 1.3139 5.0783 1.4002 1.7911 2.1897 1.4951 1.6701 4.0052 1.8878 1.2644 3.3256 1.3308 1.4830 2.9754 1.3239 1.4281 2.7638 2.9361 3.1354 2.1632 3.3531 2.6385 2.4488 2.1444 2.1774 2.0003 2.2862 1.9779 2.4623 2.0718 2.0357 1.0889 1.7645 1.9395 1.4630 2.3611 1.3171 1.4205 3.1825 1.5401 1.5544 1.2859 1.2589 1.5286 1.1064 1.0944 1.1645 1.3735 1.7330 1.4681 1.6658 1.6611 1.6530 6.5792 6.6616 1.2166 3.9701 2.9569 2.3872 1.1519 1.0724 1.0715 1.0719 2.6151 2.5213 1.0579 1.0604 1.0841 1.2611 1.0931 2.2976 8.9364 8.1584 6.7362 7.1368 7.5798 7.2168 1.0587 1.0587 1.0591 1.0585 1.0369 1.0598 1.0812 1.0782 1.0975 1.0618 1.1019 1.1002 1.1044 1.1035 1.1007 1.1030 1.0993 1.0903 1.0877 1.0897 1.0924 1.0998 1.0976 1.0932 1.0788 1.0800
irintensity: 0.0139 0.6156 0.1154 0.2888 0.6832 0.5543 0.0480 0.7160 6.5102 2.3508 0.5458 2.0330 2.5696 0.5931 0.3009 0.3578 4.0993 20.7498 2.1182 0.2457 3.8448 2.7674 8.4989 3.1848 9.5791 7.5939 1.9792 3.9059 3.1497 4.4018 2.3095 19.3788 3.7904 13.2802 13.0731 10.9004 4.3855 6.0556 2.8956 98.2888 10.4036 63.8919 18.0742 5.7433 2.4518 3.3739 11.1214 3.2474 35.1975 9.0051 9.0074 8.2183 7.5976 0.0327 11.1104 4.2183 89.4049 14.2433 48.1631 11.9001 14.1573 20.2952 4.1001 13.1133 5.4414 1.8388 49.1539 0.5469 4.7066 0.3983 0.0503 6.7303 8.3793 3.3171 2.5806 4.1101 3.4691 7.7292 4.2094 2.1600 22.3501 34.7665 5.8983 73.3941 15.8639 2.7725 6.0871 0.0164 28.8355 110.7862 28.0318 11.1986 14.6961 7.9772 273.8306 12.4242 5.4272 2.4415 5.1932 8.6922 9.8309 0.6710 16.5843 18.1509 3.9204 11.3295 0.9372 4.6984 2.6970 26.4442 0.4300 10.9971 50.3152 986.1650 133.2601 42.7394 0.4656 0.2008 2.3952 54.9719 485.4572 9.5577 5.9467 3.8177 37.3432 28.6936 62.4716 340.9334 12.4769 25.4214 45.0348 22.2671 37.7875 3.5421 1.5565 24.5129 107.9594 36.2779 2.1774 23.0089 29.4060 4.4966 18.2596 2.1632 14.3399 57.7098 63.3955 102.6703 7.0401 54.7119 6.9835 7.8304 6.1637 6.4571 11.9476 1.8278 3.9395 59.5382 114.3520
temp: 298.150 k
press: 1.00000 atm
elementType: 17 8 8 8 7 7 7 6 6 6 6 6 6 6 6 6 6 6 6 6 6 6 6 6 6 6 6 6 6 1 1 1 1 1 1 1 1 1 1 1 1 1 1 1 1 1 1 1 1 1 1 1 1 1 1
symmnumber: 1
zpe: 1160346.7 jmol-1
zpe.correction: 0.441953 hartree
zpe.thermalcorrener: 0.470927 hartree
zpe.thermalcorrenthalpy: 0.471871 hartree
zpe.thermalcorrgfe: 0.376536 hartree
zpe.sumelectzpe: -1701.786536 hartree
zpe.sumelectthermal: -1701.757562 hartree
zpe.sumelectthermalent: -1701.756618 hartree
zpe.sumelectthermalfe: -1701.851952 hartree
dipole: -1.4572 2.5905 0.4185
dipole: 3.0015
quadrupole: -169.6029 -182.9341 -177.3974
quadrupole: 19.0700 1.6866 -4.6122
quadrupole: 7.0419 -6.2893 -0.7526 19.0700 1.6866 -4.6122
hfenergy: -1702.2284885 hartree
pointgroup: C01 [X(C22H26Cl1N3O3)]
dipole: 0.4649102 1.0776037 0.1309284 debye
polarizability: 379.1178113|51.7268392|324.3741461|-1.4688366|49.1157362|185.3724186 unknown
InChI: InChI=1S/C22H26ClN3O3/c1-2-3-4-5-6-11-21(27)24-25-22(28)26-15-16-9-7-8-10-19(16)29-20-13-12-17(23)14-18(20)26/h7-10,12-14,24-25H,2-6,11,15H2,1H3
charge 0 multiplicity 1
55 atoms
Cl -5.080382 -4.902332 -1.427897
O  -4.637157 0.857083 0.320208
O  2.142216 1.344822 0.165998
O  -0.851799 -2.366183 -0.189609
N  -2.20994 -0.53533 -0.866041
N  1.313185 -0.791396 0.007573
N  0.068632 -0.249618 -0.355994
C  6.217161 -0.425211 0.556976
C  7.437326 0.212513 -0.144959
C  4.870946 0.08451 -0.00159
C  8.79101 -0.292089 0.4037
C  3.654218 -0.541084 0.723057
C  10.01036 0.359473 -0.287831
C  -2.248377 0.850651 -1.409652
C  -2.43978 1.878619 -0.313796
C  -3.470573 -1.188372 -0.686042
C  2.340133 0.087103 0.28112
C  -3.587259 1.786969 0.513194
C  -4.594437 -0.472109 -0.173285
C  11.359501 -0.153195 0.260769
C  -1.005486 -1.12823 -0.447232
C  -1.504176 2.909229 -0.062312
C  -3.639231 -2.545896 -1.066599
C  -3.816149 2.721069 1.546044
C  -5.855775 -1.107518 -0.090203
C  -1.713553 3.844808 0.975568
C  -4.895516 -3.154398 -0.943064
C  -2.875713 3.748624 1.775354
C  -6.02165 -2.451631 -0.470191
H  6.268212 -0.210167 1.645219
H  6.271432 -1.529582 0.45461
H  7.38545 1.315834 -0.035018
H  7.383962 0.006359 -1.23447
H  4.807104 1.184242 0.10007
H  4.808446 -0.137064 -1.085758
H  8.842225 -0.095209 1.495225
H  8.849054 -1.394492 0.284054
H  3.633454 -1.638202 0.572971
H  3.760298 -0.365169 1.812744
H  9.953266 1.460291 -0.163687
H  9.955759 0.167058 -1.378938
H  -1.324252 1.040252 -1.982218
H  -3.087053 0.885466 -2.128459
H  11.454859 -1.246541 0.119593
H  12.214384 0.328922 -0.248221
H  11.450793 0.053337 1.343993
H  -0.608918 2.990108 -0.693165
H  -2.773831 -3.098882 -1.43458
H  1.302946 -1.808327 0.13766
H  0.040102 0.769405 -0.233472
H  -4.722069 2.626409 2.151713
H  -6.694908 -0.527388 0.303397
H  -0.976991 4.632812 1.15946
H  -3.050107 4.468053 2.582316
H  -6.996353 -2.939503 -0.389104
