program: Gaussian 09
title: 000217578
version: EM64L-G09RevD.01
frameworkgroup: C1[X(C22H27NO)]
method: RPBEPBE
basis: SDD
operation: Freq
keyword: #p
keyword: freq=noraman
keyword: PBEPBE/SDD
title: #p freq=noraman PBEPBE/SDD
converged: YES YES NO NO
title: Mulliken charges:
elementType: O N C C C C C C C C C C C C C C C C C C C C C C H H H H H H H H H H H H H H H H H H H H H H H H H H H
charge: -0.223815 -0.069670 -0.365888 -0.354985 -0.390690 -0.398762 -0.357788 -0.397499 -0.391202 -0.424350 -0.364497 0.515001 0.084279 0.310639 -0.458632 -0.389966 -0.229799 -0.233234 -0.347406 -0.361430 -0.245938 -0.252954 -0.231289 -0.225284 0.209059 0.163412 0.166744 0.211605 0.189182 0.202525 0.203714 0.190298 0.182399 0.199277 0.188039 0.211238 0.230101 0.199603 0.206970 0.231836 0.223053 0.231867 0.264415 0.225163 0.225828 0.247312 0.276564 0.228853 0.230341 0.232749 0.233011
chargesum: 0.00000
title: Mulliken charges with hydrogens summed into heavy atoms:
elementType: O N C C C C C C C C C C C C C C C C C C C C C C
charge: -0.223815 -0.069670 0.006583 0.023365 0.001016 -0.004750 0.023888 0.001778 0.038502 0.014456 -0.141444 0.515001 0.084279 0.310639 -0.226765 -0.125551 -0.004636 -0.007407 -0.100094 -0.084866 -0.017085 -0.022613 0.001460 0.007727
polarizability: 2.59231285e+02 -7.85079681e+00 2.57977046e+02 -1.92343473e+01 4.64875380e+00 2.09041255e+02
1716.lowfreq: -7.0951 -4.9415 -0.0005 0.0002 0.0007 3.8689 15.1907 19.4462 25.8132
frequency: 15.1518 18.3522 25.4965 28.9933 38.5387 48.4850 68.7878 86.6501 115.2017 119.7655 146.4405 149.9594 174.5590 193.9908 230.2650 232.7049 252.1645 288.5269 309.6206 334.0937 372.3475 386.4928 398.3430 405.1931 413.8949 437.4037 450.3897 461.3260 478.1519 527.7480 565.7515 584.8806 612.4826 614.2842 645.6426 688.0923 695.8580 707.8912 724.0351 753.6579 766.6098 770.5673 792.7144 805.0581 844.1361 851.4382 854.0059 856.8183 857.4281 879.4341 910.3100 924.3777 941.8521 954.8968 957.8887 979.3181 987.6728 989.5729 991.1059 991.3546 996.7085 1008.8530 1024.9631 1027.3378 1039.1195 1047.6157 1050.0513 1056.8628 1079.5922 1083.6738 1090.3659 1102.0373 1114.8154 1122.5789 1149.5936 1155.1112 1167.2078 1171.7881 1173.2371 1183.5776 1189.3713 1192.1697 1217.7167 1223.3643 1245.5561 1258.4130 1264.0115 1274.3200 1283.2825 1293.1846 1299.0567 1312.0028 1329.1326 1332.6063 1338.7913 1340.3593 1344.0822 1348.6444 1351.6953 1371.9943 1381.6602 1386.7191 1393.1402 1434.6193 1441.2463 1451.4725 1454.0249 1458.5510 1460.4787 1465.9970 1469.7694 1474.8734 1477.7954 1479.7408 1484.7109 1561.1951 1590.7794 1594.2575 1607.9829 1611.5701 2808.7409 2817.0571 2840.2781 2964.8925 2981.8665 2982.9153 2984.9287 2988.6120 2998.5991 2999.9781 3017.0671 3030.6720 3038.3788 3043.4334 3045.1890 3053.3223 3065.0453 3108.9332 3123.8458 3128.6801 3134.7143 3139.8971 3145.3335 3152.5536 3162.0221 3162.8495 3171.0903
redmass: 4.1939 3.3342 3.9552 4.4346 4.4591 3.8805 3.9055 4.2165 2.0813 5.1911 3.8467 4.9462 3.2161 4.0247 2.9718 1.8169 3.7842 2.6879 2.3737 6.5022 3.1363 2.0622 2.7925 2.8481 4.2148 3.2466 2.9824 2.9135 4.8210 2.8466 2.5620 3.3725 6.2789 6.3350 3.8970 4.6472 1.7814 1.7053 1.6902 3.2135 1.5543 2.0045 2.1287 1.4807 3.3722 1.6537 1.3084 1.2485 2.1405 1.8179 2.1175 1.4531 1.4997 4.0979 1.3078 1.3951 1.6674 4.9675 3.2288 3.0643 1.3341 1.3445 2.2612 2.2155 2.5861 2.6996 2.0030 1.9671 1.7382 1.6863 1.9180 1.8607 2.2856 2.5056 1.2946 2.3674 1.3092 1.0688 1.0720 1.4003 1.1927 1.5198 1.4348 2.3279 1.9962 1.2803 1.1777 1.2851 1.3956 1.2007 1.3397 1.3402 1.2699 1.2905 1.4150 1.4410 1.3703 1.4794 1.4718 1.3846 7.3547 8.9773 1.4406 2.2579 2.1723 1.0910 1.0869 1.0800 1.0878 1.0939 1.0800 1.1078 2.1630 2.2178 1.1011 7.6292 6.1197 6.4238 5.9828 6.3704 1.0715 1.0705 1.0696 1.0622 1.0601 1.0618 1.0612 1.0616 1.0829 1.0873 1.0873 1.0959 1.0965 1.0987 1.0935 1.1032 1.1030 1.0879 1.0859 1.0852 1.0911 1.0886 1.0958 1.0927 1.0958 1.1012 1.1004
irintensity: 0.4582 0.6151 0.4752 0.5063 0.2089 0.0649 0.1017 0.4150 0.8374 1.6670 1.0116 0.8531 1.3483 0.5968 1.0701 0.3344 3.8678 1.9382 1.3934 4.5856 3.8376 3.6324 0.1905 0.0074 1.9814 0.9608 0.5488 2.1576 0.0742 20.4025 4.4390 22.8426 0.0804 0.1856 4.7894 3.7677 58.1101 57.7891 13.1712 24.9010 17.9655 38.6338 8.2525 0.0819 1.9788 2.2499 1.3520 0.4597 8.0072 6.4092 1.6202 0.7042 3.7521 54.8371 1.8130 0.0330 1.5521 2.9671 1.6142 18.9776 1.0937 1.1239 4.8538 10.2547 5.3021 1.5790 4.6505 11.6958 12.3791 6.9594 15.6377 13.2278 17.7249 5.0727 7.1060 25.1144 14.9798 1.3854 1.9996 44.8316 0.1902 0.2431 18.9342 45.2752 114.4544 5.5841 11.0676 1.9870 5.3463 11.9995 7.5699 0.6867 8.1208 2.9749 13.4221 17.3558 10.8377 3.6505 1.6437 10.8308 0.1030 2.5659 4.3149 21.3977 8.0752 6.1098 11.9240 3.8710 13.9584 12.5534 0.4007 2.5044 3.3050 20.7186 13.3316 112.0400 4.5897 20.8133 16.7566 3.4229 48.1892 85.4329 168.6252 40.6014 2.2364 37.5297 37.4625 39.7902 23.7066 9.2738 68.8752 76.4352 2.3689 46.1004 3.1909 104.7675 48.6944 11.1931 0.2995 0.1146 12.4826 8.1605 28.7531 15.6845 30.1137 23.9767 16.4181
temp: 298.150 k
press: 1.00000 atm
elementType: 8 7 6 6 6 6 6 6 6 6 6 6 6 6 6 6 6 6 6 6 6 6 6 6 1 1 1 1 1 1 1 1 1 1 1 1 1 1 1 1 1 1 1 1 1 1 1 1 1 1 1
symmnumber: 1
zpe: 1143238.2 jmol-1
zpe.correction: 0.435436 hartree
zpe.thermalcorrener: 0.457856 hartree
zpe.thermalcorrenthalpy: 0.458800 hartree
zpe.thermalcorrgfe: 0.379668 hartree
zpe.sumelectzpe: -982.732807 hartree
zpe.sumelectthermal: -982.710387 hartree
zpe.sumelectthermalent: -982.709443 hartree
zpe.sumelectthermalfe: -982.788575 hartree
dipole: 1.4372 0.1897 -1.8332
dipole: 2.3371
quadrupole: -133.4843 -132.7795 -141.4788
quadrupole: 3.1696 -7.3281 0.2359
quadrupole: 2.4299 3.1347 -5.5646 3.1696 -7.3281 0.2359
hfenergy: -983.1682431 hartree
pointgroup: C01 [X(C22H27N1O1)]
dipole: 0.5545359 -0.0949078 0.7272737 debye
polarizability: 259.7237359|7.9703182|257.2391407|19.7810185|3.0596744|209.2867096 unknown
InChI: InChI=1S/C22H27NO/c24-22(20-13-6-2-7-14-20)21(19-11-4-1-5-12-19)15-10-18-23-16-8-3-9-17-23/h1-2,4-7,11-14,21H,3,8-10,15-18H2
charge 0 multiplicity 1
51 atoms
O  0.650105 -0.778584 -1.793024
N  -4.15665 0.630106 0.230704
C  -5.300625 1.571778 0.353634
C  -4.481539 -0.480098 -0.702578
C  -6.563415 0.850511 0.868783
C  -5.719309 -1.267664 -0.226527
C  -2.89814 1.330886 -0.130947
C  -6.934865 -0.328255 -0.05836
C  -1.629196 0.515342 0.19368
C  -0.34472 1.300557 -0.151741
C  0.959104 0.547937 0.234216
C  2.184546 1.465391 0.092162
C  1.154256 -0.718714 -0.631351
C  1.964525 -1.866875 -0.097609
C  2.797823 2.02818 1.24003
C  2.686256 1.811036 -1.189563
C  3.887496 2.91899 1.113982
C  3.777599 2.698213 -1.317077
C  2.694217 -1.797251 1.120106
C  2.000274 -3.069973 -0.855717
C  4.382665 3.256119 -0.166757
C  3.439734 -2.908057 1.569014
C  2.73844 -4.180545 -0.403682
C  3.460605 -4.102845 0.81225
H  -5.011476 2.377933 1.054246
H  -5.536189 2.056266 -0.633109
H  -4.674687 -0.084034 -1.736842
H  -3.611412 -1.156472 -0.770285
H  -7.398749 1.574118 0.937726
H  -6.361869 0.468892 1.888507
H  -5.484493 -1.746306 0.743901
H  -5.943329 -2.072209 -0.953534
H  -2.883919 1.619392 -1.215353
H  -2.865464 2.275119 0.448456
H  -7.234796 0.066026 -1.051831
H  -7.8034 -0.882527 0.345447
H  -1.630894 -0.435412 -0.370569
H  -1.648701 0.258579 1.271537
H  -0.344872 2.275336 0.375648
H  -0.318941 1.513479 -1.237127
H  0.876892 0.24192 1.29542
H  2.412073 1.777972 2.237012
H  2.222621 1.380365 -2.08487
H  4.347788 3.349026 2.0109
H  4.156845 2.953764 -2.313042
H  2.703375 -0.874511 1.707554
H  1.4384 -3.103311 -1.795069
H  5.229529 3.944181 -0.266907
H  4.005534 -2.843106 2.504765
H  2.754703 -5.104453 -0.992096
H  4.036845 -4.965509 1.165387
