program: Gaussian 09
title: 000217543
version: EM64L-G09RevD.01
frameworkgroup: C1[X(C15H25NOS)]
method: RPBEPBE
basis: SDD
operation: Freq
keyword: #p
keyword: freq=noraman
keyword: PBEPBE/SDD
title: #p freq=noraman PBEPBE/SDD
converged: YES YES NO NO
title: Mulliken charges:
elementType: S O N C C C C C C C C C C C C C C C H H H H H H H H H H H H H H H H H H H H H H H H H
charge: -0.033289 -0.297046 -0.285964 -0.371524 -0.392539 -0.376638 -0.272026 0.013827 0.174004 0.330924 0.385224 -0.285571 -0.389151 -0.461710 -0.820696 -0.818619 -0.816609 -0.708046 0.215985 0.179206 0.206651 0.209230 0.212988 0.184354 0.197651 0.198573 0.241582 0.208391 0.208204 0.229800 0.227962 0.218870 0.262552 0.225028 0.252028 0.224723 0.221612 0.226741 0.222557 0.228263 0.252736 0.276143 0.093621
chargesum: 0.00000
title: Mulliken charges with hydrogens summed into heavy atoms:
elementType: S O N C C C C C C C C C C C C C C C
charge: 0.060332 -0.297046 -0.044383 0.023668 0.023342 0.020704 0.124198 0.013827 0.174004 0.330924 0.385224 0.131024 -0.159351 -0.233748 -0.114246 -0.120256 -0.139048 -0.179167
polarizability: 2.60122072e+02 -6.70893162e+00 1.87711976e+02 -1.95086325e+01 1.26930606e+00 1.31951074e+02
1716.lowfreq: -8.9999 -0.0021 -0.0006 0.0007 3.1317 5.1606 11.1356 24.1486 30.9229
frequency: 11.0679 23.9873 30.7123 34.5419 59.8339 68.6659 79.8011 92.6955 103.7745 114.4124 121.8572 134.0127 137.2909 143.5210 164.1882 167.8636 189.1854 209.6006 266.7411 275.3166 297.7704 311.1282 317.1836 340.6948 354.4341 442.1905 455.2935 462.7795 511.9944 525.2996 541.1681 599.7223 661.4305 677.8540 685.9510 725.8970 744.0295 750.5766 758.5899 803.1248 816.0188 845.1046 854.9253 924.9040 928.8842 944.1163 951.7168 995.1805 997.4320 1026.6891 1027.6004 1029.1644 1044.3064 1048.7843 1052.8759 1064.6658 1071.1104 1075.1471 1109.5964 1128.7359 1141.9619 1152.8495 1166.5768 1193.0439 1205.5727 1240.2676 1246.0720 1257.0162 1265.9766 1271.2658 1275.1430 1279.0323 1284.8550 1319.1111 1346.8002 1361.5740 1372.2537 1387.3045 1388.1831 1390.9199 1400.7505 1411.1953 1447.7640 1455.5355 1460.2451 1462.6787 1466.0631 1468.9443 1470.7743 1474.7615 1481.8599 1483.1241 1484.3094 1486.4283 1494.1907 1497.1121 1583.7336 1614.7799 2434.6395 2858.6021 2892.6652 2944.9791 2958.9731 2967.7769 2970.7173 2971.6482 2990.2647 2996.2147 2998.1854 3008.5486 3027.8115 3032.0218 3038.5107 3042.3637 3053.2016 3060.0618 3081.6206 3092.9304 3105.2464 3111.4162 3114.1890 3139.4535 3422.5318
redmass: 4.4187 3.4079 2.2801 4.3918 3.1708 2.0301 2.7126 1.1793 1.4853 1.5560 2.6479 2.5498 3.3185 2.4238 1.5569 1.5593 2.8328 1.2931 3.6092 3.1447 2.7429 3.0406 4.3337 4.0212 3.8137 3.6390 4.7190 4.3012 3.3483 3.1345 4.2140 3.8930 5.0560 1.3156 2.9983 4.6773 1.2343 1.0738 4.2803 1.1418 1.2517 1.1633 3.5019 1.2410 2.4270 1.3319 3.5617 2.7203 1.3657 1.4674 3.5999 1.9371 1.5554 1.9325 1.6086 2.6930 2.4456 2.1963 2.7102 1.3767 4.0867 1.1998 1.5076 4.1200 1.4450 1.2399 1.2512 1.6567 1.2714 3.6947 1.1238 1.1223 1.1182 1.2814 1.3894 6.4427 1.5903 1.2797 1.4650 1.2685 1.2788 2.2199 1.1108 1.1708 1.0867 1.1830 1.1041 1.0798 1.1132 1.1309 1.2411 1.8939 1.0913 1.0677 1.0744 1.0858 5.8295 7.1061 1.0383 1.0709 1.0696 1.0565 1.0646 1.0377 1.0397 1.0406 1.0625 1.1023 1.0842 1.0893 1.0988 1.0599 1.0967 1.0964 1.0922 1.1043 1.0981 1.1000 1.0963 1.1059 1.0868 1.0969 1.0739
irintensity: 0.0482 0.1036 0.4824 0.4874 1.2545 1.6953 1.1953 0.9355 2.5570 2.5261 0.3564 1.2812 2.4374 2.8587 0.8217 2.6493 4.1372 21.6832 11.7646 1.1832 0.2578 0.2793 5.9553 7.0962 1.1838 6.5386 0.8908 0.6640 0.9129 1.8480 3.8289 0.6068 3.4257 94.4545 20.3497 1.6859 5.9403 8.0674 2.0842 0.2611 31.6730 9.7536 3.8192 2.0883 7.6955 0.6831 65.9414 2.3434 17.8314 8.6971 1.2525 13.7083 2.9531 3.7611 1.9334 16.3739 94.8035 47.7747 0.7620 17.9377 90.5182 3.3694 12.9018 62.9965 2.1955 4.3824 1.3057 1.3475 4.3624 24.6606 2.1092 0.7850 1.0049 2.6606 16.9403 0.6419 26.5066 12.2502 4.2623 9.1022 14.7781 6.8822 12.6210 31.0025 7.7731 9.3994 4.8949 6.2244 5.7330 12.3129 38.3530 15.8301 13.6645 15.5169 8.5233 13.9192 5.1894 3.6540 30.2766 90.6771 87.9915 29.0893 29.3351 55.3593 36.6332 18.6556 19.8857 35.0599 33.5584 21.8218 6.6771 26.3976 45.4262 1.4599 30.2074 81.2760 25.3517 13.3573 9.8697 17.1027 11.6793 33.8823 1.4609
temp: 298.150 k
press: 1.00000 atm
elementType: 16 8 7 6 6 6 6 6 6 6 6 6 6 6 6 6 6 6 1 1 1 1 1 1 1 1 1 1 1 1 1 1 1 1 1 1 1 1 1 1 1 1 1
symmnumber: 1
zpe: 962023.3 jmol-1
zpe.correction: 0.366415 hartree
zpe.thermalcorrener: 0.388817 hartree
zpe.thermalcorrenthalpy: 0.389761 hartree
zpe.thermalcorrgfe: 0.310834 hartree
zpe.sumelectzpe: -1113.189894 hartree
zpe.sumelectthermal: -1113.167492 hartree
zpe.sumelectthermalent: -1113.166548 hartree
zpe.sumelectthermalfe: -1113.245475 hartree
dipole: 1.2989 -0.3994 -0.8443
dipole: 1.5998
quadrupole: -140.5352 -110.7411 -121.8646
quadrupole: -6.3849 -8.2490 2.6161
quadrupole: -16.1549 13.6392 2.5157 -6.3849 -8.2490 2.6161
hfenergy: -1113.5563089 hartree
pointgroup: C01 [X(C15H25N1O1S1)]
dipole: 0.5079031 -0.1920459 -0.3183181 debye
polarizability: 259.8373775|-9.5820908|187.9212709|-18.7892201|-2.6664972|132.0264733 unknown
InChI: InChI=1S/C15H25NOS/c1-12-6-7-13(2)15(14(12)3)17-10-5-4-8-16-9-11-18/h6-7,16,18H,4-5,8-11H2,1-3H3
charge 0 multiplicity 1
43 atoms
S  -9.061142 0.024295 -0.127683
O  1.237405 0.162338 0.894194
N  -4.885923 -0.150807 -0.412246
C  -2.404159 -0.057251 -0.255054
C  -1.178855 0.028347 0.682891
C  -3.737107 -0.075184 0.518321
C  0.139331 0.042183 -0.094253
C  2.541852 0.22792 0.315971
C  3.309035 -0.96534 0.228071
C  3.044673 1.494602 -0.090917
C  4.630065 -0.892228 -0.307269
C  -6.219629 -0.121061 0.226316
C  4.358689 1.536188 -0.612624
C  5.13401 0.362102 -0.726557
C  2.735849 -2.285699 0.709106
C  2.209267 2.75425 0.046842
C  5.488081 -2.140131 -0.420776
C  -7.306477 0.05561 -0.847384
H  -2.41699 0.801183 -0.954262
H  -2.33052 -0.974354 -0.87834
H  -1.171194 -0.827558 1.385392
H  -1.234887 0.946884 1.298715
H  -3.834139 0.86146 1.102746
H  -3.721346 -0.914422 1.259488
H  0.272318 -0.893571 -0.678389
H  0.175208 0.898295 -0.79995
H  -4.79344 -0.953306 -1.052101
H  -6.24405 0.744075 0.918105
H  -6.450811 -1.026625 0.837931
H  4.778194 2.499676 -0.926736
H  6.150085 0.420641 -1.134663
H  2.617245 -3.005438 -0.124576
H  1.755178 -2.131197 1.185217
H  3.405035 -2.764633 1.448795
H  1.528017 2.679392 0.911495
H  2.853736 3.641008 0.176909
H  1.585563 2.932491 -0.85161
H  5.688871 -2.589168 0.571503
H  4.994713 -2.923245 -1.028142
H  6.460512 -1.911449 -0.889184
H  -7.300962 -0.784056 -1.564731
H  -7.155754 0.992137 -1.406388
H  -8.945245 1.200446 0.596729
