program: Gaussian 09
title: 000217541
version: EM64L-G09RevD.01
frameworkgroup: C1[X(C15H25NOS)]
method: RPBEPBE
basis: SDD
operation: Freq
keyword: #p
keyword: freq=noraman
keyword: PBEPBE/SDD
title: #p freq=noraman PBEPBE/SDD
converged: YES YES NO NO
title: Mulliken charges:
elementType: S O N C C C C C C C C C C C C C C C H H H H H H H H H H H H H H H H H H H H H H H H H
charge: -0.052800 -0.280549 -0.286938 -0.357945 -0.362653 -0.395333 -0.416091 -0.378531 -0.306160 -0.291367 0.247156 -0.690075 0.299273 -0.356785 -0.387240 -0.787542 -0.242321 -0.247968 0.185006 0.190351 0.187049 0.220426 0.218093 0.182935 0.192616 0.214295 0.180901 0.211636 0.214713 0.201537 0.241672 0.200397 0.227664 0.244665 0.272184 0.247607 0.229999 0.212965 0.233848 0.236984 0.222415 0.224290 0.099623
chargesum: 0.00000
title: Mulliken charges with hydrogens summed into heavy atoms:
elementType: S O N C C C C C C C C C C C C C C C
charge: 0.046824 -0.280549 -0.045266 0.017411 0.044823 0.005695 -0.009179 0.014006 0.110089 0.136694 0.247156 -0.173226 0.299273 -0.109178 -0.157241 -0.103745 -0.019906 -0.023679
polarizability: 2.62743749e+02 4.52731588e+00 1.73048635e+02 -2.01102032e+01 5.84645449e+00 1.38303759e+02
1716.lowfreq: -8.6728 -2.6048 -0.0012 0.0009 0.0021 3.6134 9.7772 14.9832 21.5474
frequency: 4.3104 14.6187 21.4381 35.5390 44.6407 68.2618 81.3603 91.7595 109.9999 125.1237 127.8690 131.0397 139.9378 142.6256 166.2621 175.7142 194.5998 234.6805 269.4427 276.0461 301.0780 334.7710 403.9567 442.3750 464.0244 466.5959 491.0921 535.5490 543.1120 601.3681 680.2395 703.1379 716.9436 723.4520 738.6335 755.6274 768.2126 794.2810 799.7721 814.0776 840.2833 844.5323 896.6209 916.4343 925.7424 970.5591 972.4463 982.2427 984.3594 1008.4368 1032.7421 1039.4411 1046.6164 1048.5371 1074.6509 1076.4550 1089.7803 1109.6362 1116.4281 1119.4459 1145.3517 1147.9726 1171.3904 1192.2353 1195.1146 1218.6615 1231.0372 1235.5157 1245.3145 1263.2856 1276.4558 1281.6639 1284.6612 1288.1247 1293.5456 1302.5157 1336.9217 1354.9860 1365.6035 1367.2254 1386.8849 1388.7699 1399.7262 1429.1671 1449.4814 1450.4704 1457.0232 1457.5884 1464.8512 1468.7851 1472.8852 1477.4647 1482.0610 1487.5295 1491.9217 1496.6379 1595.6503 1608.7538 2436.8696 2851.8363 2874.2609 2945.3363 2952.1982 2959.5287 2968.3208 2977.6053 2979.6443 2995.1002 2998.1078 3007.4854 3020.8239 3025.5625 3030.6630 3039.7047 3054.9941 3057.0564 3088.4195 3110.0422 3121.1917 3132.2810 3153.9041 3167.5950 3422.3225
redmass: 2.8214 3.9718 3.5991 3.8416 5.3497 2.3999 3.0124 2.5188 2.1942 1.1205 1.8757 1.5786 2.5568 2.7929 2.5855 3.6579 3.7789 2.4255 4.0401 3.8405 2.8100 3.5984 4.2801 2.8719 3.2528 3.4154 4.0664 3.9868 3.4761 5.2422 1.3802 3.7628 2.3601 1.5056 1.3751 1.4684 1.6527 1.2260 2.2417 1.1915 1.6088 1.3817 1.9365 2.0507 1.3724 1.3201 1.6282 1.9620 1.6118 2.2954 2.7845 2.3872 1.5249 2.0985 2.3212 2.4741 2.1765 2.1843 1.8462 1.5215 3.7334 1.5918 1.1035 2.4546 1.3365 1.3959 2.5009 1.4431 1.2314 1.2771 1.1359 1.0993 1.2858 1.2704 1.1391 1.2136 1.3208 1.5215 1.6331 1.4948 3.4032 1.4513 1.3605 1.9794 1.1719 1.0839 1.1199 1.0461 1.0667 1.0880 1.3449 1.1595 1.0970 1.0938 1.8747 1.0846 6.8654 6.1742 1.0385 1.0711 1.0710 1.0554 1.0597 1.0639 1.0632 1.0637 1.0364 1.0852 1.0956 1.1040 1.0697 1.0975 1.0766 1.1019 1.1032 1.0968 1.1001 1.1070 1.0864 1.0892 1.0938 1.0989 1.0740
irintensity: 1.9570 0.2582 0.3272 0.1904 0.5160 2.1863 1.7783 1.8083 8.5729 5.0581 10.3773 11.0158 1.5828 1.9214 1.9673 2.3559 5.5218 0.9240 0.7512 0.0041 1.2970 2.4865 3.0607 4.0579 2.0046 1.9895 1.3733 0.9841 0.2110 3.7347 93.0620 15.4052 11.7316 10.1724 7.5707 89.3174 2.2418 5.7997 1.2301 5.7266 1.3279 0.4847 2.1191 28.3682 1.6226 0.9190 18.0323 13.1975 6.1086 1.0944 0.5020 28.0406 7.2247 14.8014 1.1842 2.7549 3.5907 6.9709 87.1658 16.9911 71.4109 2.4445 9.9224 68.6901 10.0459 4.0974 141.6978 18.5606 5.1685 17.5498 2.1000 4.2537 0.2995 1.4768 2.1249 2.9492 3.3290 3.2265 4.6185 9.3539 11.3187 4.1130 13.7512 22.1754 30.4792 7.5611 10.0902 13.6898 0.2439 1.0836 56.8614 22.7853 12.5248 5.2447 46.0167 7.2757 9.9826 38.3764 38.8775 86.0121 104.4533 36.4702 6.4882 22.6803 38.7555 44.9412 28.4348 35.2768 4.7613 52.0003 10.9826 19.7279 37.7283 15.0635 128.8135 23.0143 24.1014 24.4146 7.3047 15.3916 38.9832 15.0238 1.5145
temp: 298.150 k
press: 1.00000 atm
elementType: 16 8 7 6 6 6 6 6 6 6 6 6 6 6 6 6 6 6 1 1 1 1 1 1 1 1 1 1 1 1 1 1 1 1 1 1 1 1 1 1 1 1 1
symmnumber: 1
zpe: 966959.8 jmol-1
zpe.correction: 0.368296 hartree
zpe.thermalcorrener: 0.389933 hartree
zpe.thermalcorrenthalpy: 0.390877 hartree
zpe.thermalcorrgfe: 0.311445 hartree
zpe.sumelectzpe: -1113.183923 hartree
zpe.sumelectthermal: -1113.162285 hartree
zpe.sumelectthermalent: -1113.161341 hartree
zpe.sumelectthermalfe: -1113.240773 hartree
dipole: 0.9408 -0.6561 -0.6818
dipole: 1.3343
quadrupole: -138.7393 -109.2698 -120.5765
quadrupole: -6.6338 5.4289 0.3472
quadrupole: -15.8774 13.5920 2.2854 -6.6338 5.4289 0.3472
hfenergy: -1113.552218 hartree
pointgroup: C01 [X(C15H25N1O1S1)]
dipole: -0.3686164 -0.1958962 0.3183421 debye
polarizability: 262.7991114|-8.2489535|168.8289027|-18.717019|-12.7622504|142.4681293 unknown
InChI: InChI=1S/C15H25NOS/c1-14-8-4-5-9-15(14)17-12-7-3-2-6-10-16-11-13-18/h4-5,8-9,16,18H,2-3,6-7,10-13H2,1H3
charge 0 multiplicity 1
43 atoms
S  9.322728 0.820279 -0.13813
O  -2.505968 -0.469945 -0.311613
N  5.228841 0.322863 0.241154
C  1.77184 -1.363105 -0.231744
C  0.359033 -1.069134 0.318607
C  2.837882 -0.373544 0.288756
C  -0.699854 -2.073327 -0.187062
C  4.239655 -0.641966 -0.291688
C  -2.119885 -1.759599 0.291692
C  6.611515 0.138254 -0.247203
C  -3.784398 0.042286 -0.023299
C  7.56971 1.007671 0.582552
C  -4.08789 1.28822 -0.649722
C  -4.72319 -0.603379 0.81693
C  -5.357562 1.85637 -0.404708
C  -3.063834 1.958705 -1.542389
C  -5.985847 -0.006612 1.041826
C  -6.308709 1.223676 0.433002
H  2.068073 -2.398175 0.040789
H  1.744532 -1.328543 -1.341084
H  0.384007 -1.087746 1.428372
H  0.049952 -0.047108 0.026319
H  2.897618 -0.42243 1.393357
H  2.526464 0.66228 0.033813
H  -0.441107 -3.096588 0.154934
H  -0.697596 -2.094369 -1.294566
H  4.182099 -0.629503 -1.410472
H  4.569184 -1.66023 -0.00315
H  -2.833781 -2.544911 -0.032721
H  -2.158548 -1.676863 1.398649
H  4.908164 1.293082 0.107671
H  6.736102 0.372766 -1.333929
H  6.883081 -0.926181 -0.11656
H  7.28388 2.07274 0.530693
H  7.565911 0.675693 1.632159
H  -4.485987 -1.558232 1.294932
H  -5.603625 2.813511 -0.880425
H  -3.457847 2.902753 -1.956191
H  -2.134144 2.180091 -0.985766
H  -2.773033 1.299627 -2.381097
H  -6.710489 -0.5086 1.692759
H  -7.285544 1.687995 0.604844
H  9.976364 1.502328 0.875207
