program: Gaussian 09
title: 000217478
version: EM64L-G09RevD.01
frameworkgroup: C1[X(C23H28Cl2N4O2)]
method: RPBEPBE
basis: SDD
operation: Freq
keyword: #p
keyword: freq=noraman
keyword: PBEPBE/SDD
title: #p freq=noraman PBEPBE/SDD
converged: YES YES NO NO
title: Mulliken charges:
elementType: Cl Cl O O N N N N C C C C C C C C C C C C C C C C C C C C C C C H H H H H H H H H H H H H H H H H H H H H H H H H H H H
charge: -0.068709 -0.060065 -0.272584 -0.261031 -0.414152 -0.165640 -0.369298 -0.046381 0.327723 -0.433947 -0.387550 0.320506 -0.357437 0.228063 -0.489234 -0.103178 -0.082233 -0.306487 -0.344884 0.215334 -0.502706 -0.343338 -0.320731 -0.303109 0.290316 -0.594897 -0.666002 -0.358298 -0.298490 -0.127476 -0.536765 0.210586 0.206990 0.221763 0.248182 0.259477 0.222996 0.289940 0.247549 0.263055 0.226813 0.239855 0.232775 0.210665 0.328667 0.207661 0.264790 0.263120 0.289374 0.259029 0.288099 0.215626 0.212470 0.222736 0.245298 0.265632 0.224163 0.221664 0.243705
chargesum: 0.00000
title: Mulliken charges with hydrogens summed into heavy atoms:
elementType: Cl Cl O O N N N N C C C C C C C C C C C C C C C C C C C C C C C
charge: -0.068709 -0.060065 -0.272584 -0.261031 -0.124212 -0.165640 -0.040630 -0.046381 0.327723 -0.016371 0.082395 0.320506 0.125036 0.228063 0.021370 -0.103178 -0.082233 0.160181 0.098556 0.215334 -0.295045 -0.078548 -0.057611 -0.013736 0.290316 -0.047768 -0.015171 -0.113000 -0.032858 -0.127476 0.152767
polarizability: 4.51300491e+02 8.27671568e+01 2.90702148e+02 3.95911131e+01 -4.22808691e+01 2.53119346e+02
1716.lowfreq: -6.7953 -5.3382 0.0013 0.0018 0.0019 4.1143 9.6428 13.1535 17.8069
frequency: 7.8883 12.8182 17.6847 21.9240 28.9603 38.8037 45.7682 53.3872 63.2259 79.7006 80.4768 92.6348 98.4920 111.3746 123.0132 126.8148 151.5280 157.7963 180.1625 204.6402 215.7207 226.6363 235.9718 240.4129 247.6780 264.1790 269.1494 283.2362 287.6292 305.7369 306.6676 340.3213 344.1392 364.7164 395.2341 400.7133 401.7534 411.9638 422.8582 438.7919 466.9785 486.2558 516.7828 526.8234 532.5963 538.6752 562.9778 573.2112 603.3030 605.8223 633.9433 637.7000 658.8323 664.3653 672.1470 698.8528 726.2361 749.7782 768.3519 773.9623 784.2762 788.1678 797.7036 806.1751 809.4387 827.5380 834.0845 845.9304 856.1069 865.0491 888.6730 900.7494 939.5549 945.9858 951.4819 962.2594 966.8863 982.2026 1007.2877 1016.4399 1022.1070 1050.1712 1054.9261 1058.6404 1073.9501 1088.6273 1104.3166 1112.6360 1113.2934 1119.7419 1125.0258 1136.8154 1145.6638 1164.8751 1170.8505 1188.5898 1207.5468 1210.3571 1212.6370 1217.7140 1233.3505 1245.4941 1249.3457 1260.6920 1265.9273 1284.5544 1288.1337 1294.4467 1294.8614 1321.1171 1331.4344 1344.1769 1352.9435 1362.4168 1363.7633 1371.4236 1374.0911 1392.9897 1397.2872 1416.7270 1428.3702 1436.9299 1446.5830 1448.8698 1455.4530 1458.6535 1467.2389 1469.0393 1469.1888 1473.6654 1475.7029 1476.9865 1479.5857 1482.7736 1487.2347 1490.5251 1505.5786 1521.7496 1546.8501 1554.8950 1599.6769 1625.0392 1635.7061 2903.2511 2953.4939 2959.3487 2961.2834 2962.8722 2975.4657 2983.8395 2986.5472 3022.2966 3029.3631 3038.6426 3049.1258 3050.1502 3059.5296 3067.6014 3082.4768 3083.9066 3084.8936 3123.1278 3127.2198 3138.8403 3150.2621 3152.2489 3172.8587 3174.1058 3179.6423 3401.0148 3533.4608
redmass: 7.7505 7.0261 9.8299 6.6851 4.9824 5.8613 6.0969 5.9638 3.6740 3.7447 3.3671 2.9892 3.6003 3.8308 2.3479 4.4805 4.0322 4.2631 4.1660 4.0009 3.1950 1.8652 2.7104 1.5798 3.3812 3.6026 2.5601 2.9363 3.4772 3.0669 5.3642 3.5704 3.3751 2.8272 5.8827 3.7990 3.1411 3.2383 3.8182 4.5499 2.9200 2.5862 2.8213 3.5535 3.5687 3.9284 3.1159 3.5308 4.5769 3.3836 3.6032 5.8675 5.5281 5.9477 6.1297 6.1858 3.1562 5.9989 1.6297 1.2169 1.2603 1.7023 1.5974 1.5527 1.6606 1.8354 3.7985 2.4701 2.9587 3.1285 1.4882 5.5005 2.4877 4.2714 1.3948 2.4075 1.3456 1.8463 2.5081 2.8431 1.5248 2.7920 2.1300 2.5472 2.6630 2.1236 2.9321 1.2572 2.4878 1.8544 1.7698 2.1647 1.6317 1.5939 1.5150 1.7730 2.2984 1.5324 1.7626 1.3834 1.5130 2.7581 1.2208 1.5694 1.3781 1.1564 2.0122 1.2220 1.4846 2.2301 1.3710 1.3994 1.4020 1.3280 1.3558 1.3602 3.0868 1.2335 5.3273 3.4932 2.3292 1.4737 1.7524 1.2207 1.2702 1.1176 1.0689 1.3483 1.0759 1.2870 1.0798 1.1044 1.6053 1.3294 1.1523 1.1291 3.8752 6.0635 7.5913 3.3223 6.1341 8.5011 6.7102 1.0702 1.0681 1.0652 1.0328 1.0628 1.0666 1.0360 1.0655 1.1012 1.0909 1.0963 1.0574 1.1041 1.0977 1.0930 1.0986 1.1002 1.0931 1.0995 1.0896 1.1120 1.0865 1.0867 1.0968 1.0971 1.0932 1.0769 1.0742
irintensity: 0.3170 0.6432 0.5724 0.5902 0.2835 0.1043 3.7251 3.0074 2.3750 7.1159 4.7383 1.3800 2.0973 1.0117 1.1124 1.5157 2.1609 1.8879 3.2887 4.5761 0.2464 0.7225 4.9030 5.7150 1.4661 5.6035 1.4401 1.1961 1.1071 0.8982 0.7160 9.1889 1.7839 11.3551 1.5645 0.3264 8.2033 0.7780 5.8422 2.2666 11.9373 10.9692 21.8857 4.2719 9.6928 22.4611 54.7232 12.6931 2.4187 32.3197 2.3287 14.3145 5.6923 3.4355 58.0082 1.5494 0.3167 22.2555 72.6380 35.0636 8.9664 21.1119 4.0184 21.2409 36.1084 52.2981 10.6137 20.4005 7.5711 1.6310 24.9922 58.0216 14.9209 18.5170 5.9146 1.6100 0.8997 4.6269 39.1842 39.5537 16.9640 6.9332 34.6443 5.0501 31.6667 16.0204 2.4075 0.3402 13.6141 14.6939 6.5467 50.4996 43.9800 12.9500 31.3382 4.6209 212.1008 7.8116 22.3684 28.3194 48.8030 7.0233 10.2808 39.5126 31.8035 14.7515 9.5682 2.6551 20.6980 5.6926 6.0710 2.8097 18.8753 3.5664 16.0912 4.4344 17.5073 26.4501 38.2020 27.8622 22.9786 31.4653 96.5276 8.4846 63.9741 18.4933 8.7625 34.1688 24.2281 29.1219 46.7099 10.3644 29.9461 41.9488 8.3153 52.2058 115.7223 147.5280 122.3233 43.2149 46.9927 216.2659 142.6741 75.6971 20.0066 41.1012 111.0928 4.2715 68.1509 16.1994 105.5633 30.0850 7.3044 8.2649 10.4897 46.7896 16.9868 18.2971 39.9248 51.1463 12.1167 28.3345 12.4520 8.9348 2.3588 4.0966 6.5075 17.8070 1.8717 123.0998 15.2229
temp: 298.150 k
press: 1.00000 atm
elementType: 17 17 8 8 7 7 7 7 6 6 6 6 6 6 6 6 6 6 6 6 6 6 6 6 6 6 6 6 6 6 6 1 1 1 1 1 1 1 1 1 1 1 1 1 1 1 1 1 1 1 1 1 1 1 1 1 1 1 1
symmnumber: 1
zpe: 1244959.7 jmol-1
zpe.correction: 0.474180 hartree
zpe.thermalcorrener: 0.505539 hartree
zpe.thermalcorrenthalpy: 0.506483 hartree
zpe.thermalcorrgfe: 0.406292 hartree
zpe.sumelectzpe: -2180.523163 hartree
zpe.sumelectthermal: -2180.491804 hartree
zpe.sumelectthermalent: -2180.490860 hartree
zpe.sumelectthermalfe: -2180.591051 hartree
dipole: -1.5463 -7.5442 2.2662
dipole: 8.0276
quadrupole: -178.9169 -200.4371 -189.5991
quadrupole: -11.8564 -2.2287 -3.4081
quadrupole: 10.7341 -10.7861 0.0519 -11.8564 -2.2287 -3.4081
hfenergy: -2180.9973432 hartree
pointgroup: C01 [X(C23H28Cl2N4O2)]
dipole: 0.1315016 -3.0762692 -0.7029351 debye
polarizability: 430.3849912|-96.7756131|321.9328585|40.1428748|37.9509062|242.8041354 unknown
InChI: InChI=1S/C23H28Cl2N4O2/c1-3-29(12-9-24)15-22(30)26-10-4-11-27-23-18-7-5-16(25)13-21(18)28-20-8-6-17(31-2)14-19(20)23/h5-8,13-14,26-27H,3-4,9-12,15H2,1-2H3
charge 0 multiplicity 1
59 atoms
Cl -5.587996 1.706738 -0.859017
Cl -2.361687 5.125641 0.198677
O  5.676126 -1.619447 -0.719178
O  0.34631 -1.078591 1.409885
N  1.018377 -0.401131 -2.403891
N  -3.358576 -1.079357 1.265969
N  -1.200547 -2.104234 -0.024001
N  1.994832 2.384778 0.723494
C  1.341955 0.558318 -1.444472
C  -0.375225 -2.489851 -2.358131
C  -0.314956 -0.976319 -2.672268
C  2.608123 0.463438 -0.752358
C  -0.222896 -2.818298 -0.850501
C  0.473563 1.655466 -1.118436
C  -2.036591 -0.517049 1.644022
C  2.877025 1.415275 0.314444
C  0.830903 2.500651 0.020541
C  -4.395936 -0.050423 0.985048
C  -3.79926 -2.176872 2.178074
C  -0.84323 -1.26957 1.016226
C  3.585794 -0.539032 -1.039044
C  -0.693311 2.016063 -1.883054
C  4.127783 1.32617 1.012833
C  -0.07471 3.548671 0.425769
C  4.795121 -0.591153 -0.339156
C  -4.285574 0.385218 -0.48201
C  -4.812087 -3.136451 1.528321
C  5.076273 0.357603 0.700631
C  -1.53389 3.060222 -1.499349
C  -1.220366 3.792945 -0.310526
C  6.942985 -1.739214 0.006763
H  0.409584 -3.035585 -2.921138
H  -1.346955 -2.874972 -2.730107
H  -0.605546 -0.80923 -3.729499
H  -1.053993 -0.463581 -2.037466
H  0.773902 -2.521419 -0.476963
H  -0.318068 -3.913087 -0.707894
H  1.791627 -0.997377 -2.704373
H  -1.875126 -0.494242 2.742654
H  -1.959436 0.53089 1.297048
H  -5.396838 -0.48166 1.156797
H  -4.303131 0.835921 1.649037
H  -2.893828 -2.747478 2.45674
H  -4.220397 -1.762084 3.124448
H  -2.21695 -2.162166 -0.18643
H  3.438868 -1.307853 -1.80605
H  -0.902473 1.506847 -2.828063
H  4.299826 2.057679 1.807918
H  0.20009 4.138532 1.303605
H  -4.492929 -0.448613 -1.168861
H  -3.319383 0.858972 -0.714746
H  -5.744214 -2.621724 1.233355
H  -4.380988 -3.606946 0.626167
H  -5.086168 -3.936841 2.239535
H  6.019515 0.32012 1.253348
H  -2.403709 3.338455 -2.101006
H  6.775649 -1.931268 1.084293
H  7.568749 -0.834165 -0.117584
H  7.450791 -2.602833 -0.447471
