program: Gaussian 09
title: 000217446
version: EM64L-G09RevD.01
frameworkgroup: C1[X(C15H23NOS)]
method: RPBEPBE
basis: SDD
operation: Freq
keyword: #p
keyword: freq=noraman
keyword: PBEPBE/SDD
title: #p freq=noraman PBEPBE/SDD
converged: YES YES NO NO
title: Mulliken charges:
elementType: S O N C C C C C C C C C C C C C C C H H H H H H H H H H H H H H H H H H H H H H H
charge: 0.116983 -0.269066 -0.050158 -0.356132 -0.342344 -0.374715 -0.407443 -0.716970 -0.355617 -0.638790 -0.563402 0.514877 -0.381477 -0.434276 -0.359214 -0.354784 0.314601 -0.538508 0.248850 0.206804 0.224826 0.234651 0.233246 0.193367 0.203763 0.263333 0.254114 0.236460 0.199454 0.225928 0.219965 0.226948 0.200959 0.198788 0.232009 0.228449 0.246299 0.236331 0.219042 0.219177 0.243674
chargesum: 0.00000
title: Mulliken charges with hydrogens summed into heavy atoms:
elementType: S O N C C C C C C C C C C C C C C C
charge: 0.116983 -0.269066 -0.050158 -0.107283 0.089286 0.093182 -0.010313 -0.199523 0.080298 0.034051 -0.163655 0.514877 -0.149468 -0.205828 -0.112915 -0.118454 0.314601 0.143386
polarizability: 2.47714826e+02 -2.38870650e+01 1.64708989e+02 1.34824832e+01 5.24615358e+00 1.55794042e+02
1716.lowfreq: -17.6248 -5.7579 -0.0012 -0.0007 0.0005 5.0227 10.8727 16.6724 24.1673
frequency: 7.3886 15.6300 20.4587 42.6145 51.9215 78.1984 92.9002 114.1506 142.2242 185.3377 213.2691 221.1695 227.4883 235.5248 246.1633 276.2262 289.3230 333.4887 356.3044 394.1664 412.7251 429.3170 436.7175 454.2341 500.4369 532.0275 536.5495 548.1045 626.0804 634.4351 660.5092 711.2724 722.9598 737.1338 759.8497 808.7801 818.1326 831.1355 841.0390 854.2337 882.0344 912.8507 933.7256 936.7029 961.7302 989.3598 992.4979 1001.7007 1004.6315 1011.3099 1033.2484 1053.3284 1071.7878 1091.6625 1093.1189 1112.8632 1121.6515 1133.6371 1139.8008 1153.3905 1156.7143 1181.5053 1202.4319 1217.6178 1220.9736 1227.9196 1245.0235 1263.1449 1269.5945 1281.8449 1297.3781 1308.5772 1312.8992 1324.9983 1348.8162 1356.3570 1380.0935 1383.7404 1393.2004 1417.0947 1436.4145 1453.2091 1455.5998 1460.4133 1464.7371 1465.9723 1468.7353 1473.7331 1474.7356 1481.4223 1486.7238 1502.9753 1586.1937 1624.6937 2916.6218 2955.7044 2965.2535 2966.6168 2980.9334 2984.5834 3006.9677 3016.1624 3026.6371 3032.2111 3034.3235 3042.0073 3054.7239 3065.2070 3082.5191 3086.6942 3104.0317 3108.7800 3116.4479 3121.2984 3122.0414 3159.1584 3164.5505
redmass: 4.1370 3.8155 4.5100 4.0297 4.2056 3.7539 2.5543 2.7419 3.1383 2.9463 2.4119 1.4306 1.6163 2.6632 1.5383 2.4853 2.4411 2.5948 3.4611 2.7485 2.9752 4.9823 4.4444 3.0060 3.4508 3.3166 3.6134 3.0711 3.1959 6.7171 3.3769 3.5832 1.6775 3.6489 1.4286 1.7253 2.3102 1.7707 1.5409 1.6748 1.7954 2.9921 1.6688 1.6192 1.3546 3.5929 2.3830 1.6089 2.4158 1.6970 2.9969 1.8066 1.9775 1.7535 1.9948 1.2602 1.4406 1.7869 1.4449 1.3362 1.3209 1.2201 1.4860 2.0016 1.5696 4.3330 1.4409 1.3414 1.2522 1.1194 1.3680 1.2832 1.1846 1.3973 1.4885 1.5188 1.2823 5.0578 1.2956 3.2317 1.1707 1.0716 1.0768 1.0676 1.0612 1.0504 1.0857 1.0768 1.0774 1.0783 1.0969 2.4805 6.9850 6.4983 1.0673 1.0331 1.0597 1.0600 1.0626 1.0375 1.0955 1.1006 1.0584 1.0609 1.0933 1.1038 1.1029 1.0882 1.0975 1.1022 1.0995 1.1076 1.0894 1.0918 1.0964 1.0934 1.0951
irintensity: 1.0228 0.3828 0.2962 0.6179 1.2907 1.2009 2.8541 2.9679 2.4076 1.2131 1.8615 0.7503 0.9433 2.3063 0.1490 1.3016 2.5451 1.2649 6.9511 6.0743 1.1081 25.0811 2.0272 12.0182 0.8349 28.7857 3.6295 18.2946 47.4319 0.2957 4.5717 8.3047 8.8893 6.5954 5.7016 28.6038 2.1783 25.4868 15.7200 19.0724 5.0551 18.2924 3.9379 2.8177 0.1852 19.7722 25.3126 3.7794 19.9205 13.3357 4.7026 17.5866 1.9892 7.2565 41.6231 0.2503 18.5072 33.5905 11.0126 18.5243 0.8405 48.2657 27.5308 30.8788 28.8247 148.5429 1.1159 3.2537 3.5221 3.0256 11.6894 0.6143 4.7963 1.4319 30.7284 5.8183 1.3413 7.8677 21.7826 1.5795 9.3739 3.2296 1.3235 7.5765 10.4461 12.7953 2.1725 62.2994 14.4931 13.4152 17.1496 124.6986 7.6007 34.3631 44.3477 72.8420 0.7108 45.6105 57.8099 28.3759 16.7247 4.2484 26.3521 35.6888 27.1121 52.5298 62.6065 8.8171 26.6067 18.9348 23.7946 30.9724 22.0835 36.0625 7.1399 18.5140 4.7760
temp: 298.150 k
press: 1.00000 atm
elementType: 16 8 7 6 6 6 6 6 6 6 6 6 6 6 6 6 6 6 1 1 1 1 1 1 1 1 1 1 1 1 1 1 1 1 1 1 1 1 1 1 1
symmnumber: 1
zpe: 919746.5 jmol-1
zpe.correction: 0.350313 hartree
zpe.thermalcorrener: 0.369655 hartree
zpe.thermalcorrenthalpy: 0.370599 hartree
zpe.thermalcorrgfe: 0.298097 hartree
zpe.sumelectzpe: -1112.011795 hartree
zpe.sumelectthermal: -1111.992453 hartree
zpe.sumelectthermalent: -1111.991508 hartree
zpe.sumelectthermalfe: -1112.064011 hartree
dipole: -2.2911 -1.4917 -0.5869
dipole: 2.7962
quadrupole: -125.9907 -115.9617 -110.9985
quadrupole: -4.7770 18.2096 0.0356
quadrupole: -8.3404 1.6887 6.6518 -4.7770 18.2096 0.0356
hfenergy: -1112.3621076 hartree
pointgroup: C01 [X(C15H23N1O1S1)]
dipole: -0.8933234 -0.6402379 -0.0481752 debye
polarizability: 246.3813298|-16.9327078|166.6682684|24.3882446|0.7022268|155.1682582 unknown
InChI: InChI=1S/C15H23NOS/c1-13-16(11-12-18-13)10-4-3-5-14-6-8-15(17-2)9-7-14/h6-9,13H,3-5,10-12H2,1-2H3
charge 0 multiplicity 1
41 atoms
S  6.036587 0.402566 -0.607887
O  -5.558995 1.246723 -0.55997
N  3.318552 0.112247 -0.12317
C  4.129072 0.823895 -1.093135
C  3.017024 -1.305711 -0.4853
C  3.946517 0.267664 1.212171
C  1.787624 -1.866549 0.260341
C  5.460759 -0.123064 1.117688
C  0.475917 -1.12472 -0.07263
C  3.9517 2.345172 -1.103424
C  -0.74346 -1.681599 0.712567
C  -2.038345 -0.954512 0.38062
C  -2.348014 0.294943 0.985045
C  -2.952918 -1.471155 -0.567087
C  -3.519485 1.000367 0.655695
C  -4.137141 -0.778853 -0.915858
C  -4.418892 0.464687 -0.300369
C  -6.512856 0.736916 -1.545506
H  3.984077 0.400107 -2.100045
H  2.809869 -1.327031 -1.571524
H  3.900846 -1.962411 -0.312364
H  3.417878 -0.351646 1.955713
H  3.859997 1.320698 1.530349
H  1.959151 -1.840864 1.356243
H  1.689938 -2.939349 -0.006063
H  6.056776 0.412131 1.873572
H  5.613296 -1.209427 1.22839
H  0.601958 -0.047396 0.145126
H  0.271501 -1.200668 -1.16003
H  4.654095 2.802022 -1.821839
H  2.918061 2.602848 -1.403276
H  4.155015 2.789916 -0.115039
H  -0.529051 -1.600556 1.797574
H  -0.849441 -2.76245 0.490949
H  -1.660881 0.718815 1.728105
H  -2.741987 -2.436365 -1.044711
H  -3.761721 1.960033 1.122696
H  -4.820013 -1.21498 -1.651441
H  -6.943271 -0.233338 -1.22822
H  -6.042398 0.62384 -2.542078
H  -7.308338 1.495053 -1.595975
