program: Gaussian 09
title: 000217442
version: EM64L-G09RevD.01
frameworkgroup: C1[X(C14H21NOS)]
method: RPBEPBE
basis: SDD
operation: Freq
keyword: #p
keyword: freq=noraman
keyword: PBEPBE/SDD
title: #p freq=noraman PBEPBE/SDD
converged: YES YES NO NO
title: Mulliken charges:
elementType: S O N C C C C C C C C C C C C C C H H H H H H H H H H H H H H H H H H H H H
charge: 0.163726 -0.267714 -0.106805 0.004226 -0.294104 -0.647353 -0.430224 -0.642426 -0.706191 0.519464 -0.703093 -0.377630 -0.437047 -0.364795 -0.361234 0.315780 -0.537963 0.203708 0.201317 0.241131 0.224968 0.236031 0.236892 0.210356 0.231836 0.272384 0.268881 0.251229 0.216563 0.238991 0.208300 0.231781 0.227852 0.248146 0.238079 0.219681 0.244863 0.220396
chargesum: 0.00000
title: Mulliken charges with hydrogens summed into heavy atoms:
elementType: S O N C C C C C C C C C C C C C C
charge: 0.163726 -0.267714 -0.106805 0.207934 0.148344 -0.186355 0.017024 -0.138206 -0.186082 0.519464 -0.039239 -0.145849 -0.209195 -0.116649 -0.123155 0.315780 0.146977
polarizability: 2.55960420e+02 -5.65259574e+00 1.51014582e+02 -3.87842916e+00 -8.60847175e+00 1.29534436e+02
1716.lowfreq: -0.0025 -0.0021 -0.0012 3.2492 7.3378 22.0237 24.6859 37.8651 51.3092
frequency: 23.4879 37.8554 51.1529 58.5938 92.9285 100.3625 117.4958 139.9734 156.7914 172.4179 192.0803 221.1943 230.0824 257.0575 303.6780 327.5429 342.5709 353.4727 393.8424 414.8693 435.2869 470.3918 506.4916 515.7673 561.6679 603.0114 634.0183 654.4511 706.9518 714.7647 741.8576 763.8607 791.9120 811.2333 817.3612 835.6518 853.1266 889.8409 928.6613 938.8957 952.5545 961.2749 974.2620 989.6807 1003.1834 1003.8722 1010.1680 1040.5346 1063.5328 1097.5232 1112.6843 1115.0828 1129.0672 1139.6043 1148.8311 1156.1726 1176.4837 1179.5170 1194.5849 1213.9913 1220.5613 1229.7066 1266.2196 1275.0754 1280.9294 1296.4849 1306.7223 1327.3601 1331.3039 1355.6008 1361.2873 1383.4724 1391.6116 1416.8637 1436.3275 1449.6704 1464.5444 1465.2790 1468.3269 1473.3928 1473.6358 1478.8845 1487.4955 1498.4941 1502.7671 1583.5612 1624.7140 2812.0576 2862.2614 2895.9197 2956.8942 2986.6535 2993.6689 2996.5870 3039.6865 3042.6155 3043.5832 3053.4253 3059.0086 3077.2495 3082.3055 3088.3272 3119.5669 3121.2298 3122.1688 3123.5326 3157.7215 3164.7013
redmass: 4.4982 4.2301 3.4387 3.9547 3.1759 3.4887 2.9194 4.4901 2.4160 2.5270 1.3714 2.9358 1.2697 2.2100 3.5206 2.4898 2.6032 2.7356 4.4954 2.9513 4.0327 3.9545 3.3657 3.1372 2.8453 3.1191 6.8206 4.2187 3.8819 4.0678 3.7411 1.8810 1.7548 2.2618 1.5369 1.7462 2.3401 1.9399 1.5040 1.3789 1.6625 1.3596 2.0453 8.6399 2.1436 2.4474 1.5580 1.6178 1.8266 2.6144 1.2665 1.4246 2.6033 1.3371 1.6759 1.3444 1.3580 1.2273 1.5114 1.4480 1.8656 4.4300 1.1774 1.1872 1.3268 1.2276 1.3207 1.3581 1.6363 1.3877 1.3614 4.6373 1.2261 3.2913 1.1722 1.0949 1.0787 1.0505 1.0560 1.0894 1.0820 1.0641 1.0847 1.0813 2.3611 6.9692 6.4957 1.0806 1.0709 1.0688 1.0331 1.0362 1.0612 1.0620 1.0872 1.0705 1.1038 1.1003 1.0844 1.0990 1.0929 1.0997 1.0894 1.1099 1.0910 1.0969 1.0939 1.0952
irintensity: 0.6292 0.4868 0.8946 0.9796 2.4666 3.6475 1.5133 1.5272 1.0127 1.4412 1.4529 0.6933 0.1759 3.6921 0.5472 4.7008 2.0330 1.8262 2.0943 0.0067 0.6550 0.5046 4.1977 19.1876 15.0400 3.6513 0.2946 2.9869 7.5719 11.2904 2.2709 3.1718 30.1663 12.2495 2.2121 28.3190 15.4806 16.9849 1.7099 1.0116 2.8415 0.8678 3.9548 41.7680 5.8992 20.9838 10.0831 28.4547 1.7590 4.8024 0.6774 18.6575 41.8679 7.8239 28.1653 0.1476 21.5644 42.2760 4.9046 6.0170 29.7341 157.4183 5.5431 33.9823 3.1318 10.9735 2.4773 24.0303 0.8653 1.7191 10.1000 9.9110 31.6464 1.8562 10.0769 8.0061 1.2492 13.0330 2.5357 35.1708 35.2638 0.5980 23.1557 3.5804 126.1737 8.6910 40.4409 68.2917 88.1412 91.0745 70.9194 33.1627 44.0666 10.0736 32.8939 6.3694 50.5206 16.9831 38.9421 53.1711 15.5273 50.7984 17.4136 18.6059 41.2566 4.9168 16.2570 4.9558
temp: 298.150 k
press: 1.00000 atm
elementType: 16 8 7 6 6 6 6 6 6 6 6 6 6 6 6 6 6 1 1 1 1 1 1 1 1 1 1 1 1 1 1 1 1 1 1 1 1 1
symmnumber: 1
zpe: 846206.7 jmol-1
zpe.correction: 0.322303 hartree
zpe.thermalcorrener: 0.340118 hartree
zpe.thermalcorrenthalpy: 0.341062 hartree
zpe.thermalcorrgfe: 0.275129 hartree
zpe.sumelectzpe: -1072.776498 hartree
zpe.sumelectthermal: -1072.758684 hartree
zpe.sumelectthermalent: -1072.757740 hartree
zpe.sumelectthermalfe: -1072.823672 hartree
dipole: -2.4145 2.1601 0.6199
dipole: 3.2985
quadrupole: -108.1718 -110.2898 -111.3508
quadrupole: -0.8187 11.7431 -1.4251
quadrupole: 1.7657 -0.3524 -1.4133 -0.8187 11.7431 -1.4251
hfenergy: -1073.0988012 hartree
pointgroup: C01 [X(C14H21N1O1S1)]
dipole: 0.9004114 -0.8891424 0.2877071 debye
polarizability: 254.8860698|-10.9061395|152.2963471|7.2232469|7.5401478|129.3270211 unknown
InChI: InChI=1S/C14H21NOS/c1-3-13(15-8-9-17-11-15)10-12-4-6-14(16-2)7-5-12/h4-7,13H,3,8-11H2,1-2H3
charge 0 multiplicity 1
38 atoms
S  -5.179444 1.410643 -0.60419
O  5.044733 0.346541 0.653222
N  -2.904487 -0.018586 -0.111843
C  -1.471034 -0.124871 0.311259
C  -3.882163 -0.44666 0.92524
C  -0.534549 0.346537 -0.846886
C  -1.124871 -1.564761 0.778518
C  -3.277896 1.342635 -0.566811
C  -5.281565 -0.240285 0.330159
C  0.942029 0.316185 -0.481374
C  -1.407311 -2.667052 -0.265561
C  1.474564 1.243576 0.457729
C  1.831757 -0.62273 -1.053488
C  2.8344 1.229121 0.813951
C  3.204579 -0.655621 -0.710803
C  3.706361 0.274859 0.230935
C  5.986455 -0.612964 0.073901
H  -1.288701 0.559565 1.184359
H  -3.778021 0.146006 1.869345
H  -3.727438 -1.51147 1.168103
H  -0.806747 1.382445 -1.123796
H  -0.732169 -0.282002 -1.7342
H  -0.052686 -1.573324 1.049565
H  -1.672796 -1.788925 1.713979
H  -2.929383 2.143413 0.126503
H  -2.91072 1.536624 -1.585226
H  -5.53585 -1.032685 -0.38998
H  -6.058298 -0.156638 1.106188
H  -0.756929 -2.559978 -1.152213
H  -2.452793 -2.622437 -0.617711
H  -1.220499 -3.668051 0.164616
H  0.814175 1.994917 0.908539
H  1.451611 -1.345227 -1.786263
H  3.246799 1.944627 1.532129
H  3.859054 -1.39674 -1.179822
H  5.699188 -1.655855 0.312853
H  6.956073 -0.380565 0.538337
H  6.061266 -0.492769 -1.024762
