program: Gaussian 09
title: 000217430
version: EM64L-G09RevD.01
frameworkgroup: C1[X(C12H18BrNO3S2)]
method: RPBEPBE
basis: SDD
operation: Freq
keyword: #p
keyword: freq=noraman
keyword: PBEPBE/SDD
title: #p freq=noraman PBEPBE/SDD
converged: YES YES NO NO
title: Mulliken charges:
elementType: Br S S O O O N C C C C C C C C C C C C H H H H H H H H H H H H H H H H H H
charge: 0.003309 0.099660 0.970781 -0.558799 -0.495310 -0.502172 -0.279659 -0.380138 -0.373350 -0.367918 -0.568218 0.517085 -0.265864 -0.762596 -0.405571 -0.404175 -0.185976 -0.186355 -0.214367 0.189200 0.219653 0.210303 0.211437 0.220370 0.201001 0.210360 0.210607 0.271598 0.229211 0.220551 0.298940 0.308487 0.239937 0.239645 0.249247 0.249194 0.379895
chargesum: 0.00000
title: Mulliken charges with hydrogens summed into heavy atoms:
elementType: Br S S O O O N C C C C C C C C C C C C
charge: 0.003309 0.099660 0.970781 -0.178904 -0.495310 -0.502172 -0.008062 0.028714 0.048390 0.053453 -0.147251 0.517085 0.183898 -0.155170 -0.165634 -0.164530 0.063270 0.062839 -0.214367
polarizability: 4.68209614e+02 -2.38487372e+01 1.86376301e+02 -1.91757195e+01 1.54012305e+01 1.55601551e+02
1716.lowfreq: -10.0378 -3.4553 0.0010 0.0021 0.0023 3.4955 8.2374 14.9501 17.2782
frequency: 6.6803 13.9721 17.1256 20.4863 31.6870 38.6054 52.9628 86.7575 90.9051 112.8714 115.7394 123.0266 137.8937 149.5661 160.2069 189.8749 205.6747 213.5312 227.1787 244.6280 260.8661 289.5082 304.7336 310.6073 352.3100 356.2586 403.5095 405.8035 422.8325 457.6463 524.6238 525.0582 607.9141 622.5046 625.2197 698.1281 719.2025 741.6965 743.2949 788.7150 797.6236 826.8106 833.7666 837.5267 906.4687 930.8485 952.2211 970.2655 975.1788 995.4138 1011.8988 1021.3449 1049.9023 1058.1896 1059.7086 1060.9744 1073.0521 1089.4629 1115.3979 1130.3692 1155.4177 1185.6222 1186.1015 1214.9400 1233.8892 1241.1181 1265.6241 1280.9311 1284.2021 1289.8080 1298.5946 1305.2869 1334.3988 1351.4083 1372.1295 1380.6037 1391.2500 1421.5643 1455.7332 1467.5662 1469.5256 1472.6536 1479.2786 1486.3081 1492.0543 1580.7714 1597.1163 2875.0879 2914.6952 2956.2236 2960.8602 2972.2285 2982.8687 2998.5186 3012.3411 3024.4824 3032.7126 3053.5885 3056.3200 3125.2956 3127.9681 3166.8434 3169.9952 3453.7478 3454.7680
redmass: 8.6216 4.2292 8.3799 5.7842 7.1394 4.8579 4.6800 2.8062 2.3865 4.6805 3.8655 3.7935 2.5038 3.1626 4.3790 1.8739 4.4077 3.3938 6.5687 4.7698 6.0753 8.7283 5.5518 5.5157 2.5586 5.6547 12.7980 2.8741 3.6257 3.7877 4.6464 5.7368 1.4541 3.4622 6.8787 4.9215 3.5600 1.0923 1.1881 1.1944 3.1111 15.6843 1.2553 1.7910 1.3079 8.8727 1.3868 1.3752 2.0455 5.0322 2.3572 4.1143 2.8330 1.6201 1.8105 1.6615 2.1589 2.9328 1.3026 1.1669 3.5072 1.4546 1.1215 2.4765 1.2524 1.3182 1.2861 1.1215 1.1168 1.1172 1.2494 1.3348 1.3380 1.4863 6.9693 1.4264 2.5747 1.0793 1.2382 1.2123 1.1298 1.8109 1.0961 1.0882 1.0912 7.1975 6.2466 1.0702 1.0693 1.0637 1.0631 1.0597 1.0601 1.0850 1.0986 1.0902 1.1021 1.1044 1.0978 1.0899 1.0898 1.0948 1.0958 1.0683 1.0726
irintensity: 0.7977 0.0740 0.6991 0.2358 0.2381 0.8141 1.8993 0.4671 0.6594 11.7467 8.7387 2.8335 6.2792 6.7987 4.2812 70.8954 1.3725 37.8464 18.1890 5.3830 29.3911 9.8117 12.3563 21.2459 0.0765 12.9477 42.4035 0.0055 43.2109 20.9172 144.3567 78.3015 250.8468 14.7684 0.2227 1.7722 5.5596 2.7060 14.1494 3.0005 21.3218 94.5814 1.0001 46.1623 8.8129 75.3536 0.0236 0.0680 2.3010 58.5388 7.4299 0.1189 5.9403 8.6744 81.3330 6.1821 0.6765 0.7404 28.0922 18.0899 14.0542 77.8806 3.7598 2.5092 34.2863 5.3638 19.1092 6.1565 2.6778 13.6383 0.3897 18.9077 9.8088 1.0212 0.0130 92.9293 5.6559 14.9962 40.6848 19.4040 1.1041 79.9682 1.7449 4.0420 23.5960 0.1160 4.0648 86.8093 33.8104 3.6575 13.4322 4.6124 64.8511 33.9373 2.1596 22.1969 4.4814 81.7084 8.5358 11.5872 15.3216 10.3672 0.3839 97.5213 17.6962
temp: 298.150 k
press: 1.00000 atm
elementType: 35 16 16 8 8 8 7 6 6 6 6 6 6 6 6 6 6 6 6 1 1 1 1 1 1 1 1 1 1 1 1 1 1 1 1 1 1
symmnumber: 1
zpe: 742454.3 jmol-1
zpe.correction: 0.282786 hartree
zpe.thermalcorrener: 0.306116 hartree
zpe.thermalcorrenthalpy: 0.307060 hartree
zpe.thermalcorrgfe: 0.221959 hartree
zpe.sumelectzpe: -1556.421451 hartree
zpe.sumelectthermal: -1556.398121 hartree
zpe.sumelectthermalent: -1556.397177 hartree
zpe.sumelectthermalfe: -1556.482278 hartree
dipole: 2.2651 -0.3359 0.2655
dipole: 2.3052
quadrupole: -209.8813 -128.1166 -142.6043
quadrupole: -8.1379 6.8186 3.0319
quadrupole: -49.6806 32.0841 17.5965 -8.1379 6.8186 3.0319
hfenergy: -1556.7042369 hartree
pointgroup: C01 [X(C12H18Br1N1O3S2)]
dipole: -0.8966198 0.1253938 0.0535381 debye
polarizability: 468.066354|-9.1480712|176.6392373|30.5153961|-20.1743867|165.4818757 unknown
InChI: InChI=1S/C12H17BrNS.HO3S/c13-12-6-4-11(5-7-12)3-1-2-8-14-9-10-15;1-4(2)3/h4-7,14H,1-3,8-10H2;1H
charge 0 multiplicity 1
37 atoms
Br -8.515785 -1.270792 -0.809264
S  5.989731 0.626717 -1.509556
S  7.097246 -0.650845 0.305666
O  6.767669 -2.348502 -0.383015
O  8.701405 -0.48896 0.43528
O  6.182101 -0.461734 1.635416
N  2.139964 0.593431 0.000213
C  -0.299399 0.701951 0.49061
C  -1.705766 0.196033 0.102321
C  0.810907 0.077947 -0.37721
C  -2.824348 0.803916 0.994474
C  -4.210631 0.325499 0.590907
C  3.29375 0.143502 -0.789325
C  4.490497 1.061129 -0.479446
C  -4.969939 1.029425 -0.378475
C  -4.76132 -0.861975 1.13727
C  -6.238366 0.568973 -0.799042
C  -6.027584 -1.341987 0.73215
C  -6.751122 -0.617361 -0.236475
H  -0.10789 0.466893 1.559402
H  -0.251009 1.804143 0.393676
H  -1.744637 -0.909405 0.176521
H  -1.914124 0.445617 -0.957438
H  0.637956 0.329738 -1.442567
H  0.756778 -1.036333 -0.30155
H  -2.6202 0.535958 2.049684
H  -2.768289 1.908093 0.927682
H  2.309574 0.587035 1.014594
H  3.588092 -0.915414 -0.601583
H  3.028355 0.218925 -1.861179
H  4.258369 2.125537 -0.667756
H  4.792776 0.957946 0.584204
H  -4.571588 1.954979 -0.811664
H  -4.199918 -1.42208 1.894949
H  -6.814015 1.125165 -1.544508
H  -6.441015 -2.257338 1.165406
H  7.462174 -2.961928 0.002828
