program: Gaussian 09
title: 000217425
version: EM64L-G09RevD.01
frameworkgroup: C1[X(C15H23NO2)]
method: RPBEPBE
basis: SDD
operation: Freq
keyword: #p
keyword: freq=noraman
keyword: PBEPBE/SDD
title: #p freq=noraman PBEPBE/SDD
converged: YES YES NO NO
title: Mulliken charges:
elementType: O O N C C C C C C C C C C C C C C C H H H H H H H H H H H H H H H H H H H H H H H
charge: -0.448872 -0.269466 -0.018813 0.271302 -0.572634 -0.555512 -0.165995 -0.464487 0.488503 -0.382853 -0.635077 -0.514087 -0.465516 -0.711886 0.296969 -0.217230 -0.378225 -0.541812 0.223171 0.233142 0.201585 0.240852 0.192576 0.237894 0.215264 0.201997 0.238815 0.223241 0.214794 0.230671 0.252734 0.227764 0.334838 0.195884 0.243397 0.217233 0.221581 0.249619 0.215562 0.242626 0.230452
chargesum: 0.00000
title: Mulliken charges with hydrogens summed into heavy atoms:
elementType: O O N C C C C C C C C C C C C C C C
charge: -0.114034 -0.269466 -0.018813 0.271302 -0.116322 -0.113076 0.026581 -0.011328 0.488503 0.057959 0.033629 -0.261353 -0.237752 -0.055372 0.296969 0.004350 -0.128606 0.146829
polarizability: 2.00193713e+02 -2.01101016e+00 1.47542062e+02 -3.58886497e+00 -5.07732924e+00 1.69417421e+02
1716.lowfreq: -15.2866 -7.4521 -0.0005 0.0003 0.0007 5.3572 21.7288 29.3302 62.6291
frequency: 19.3964 27.8484 62.5851 89.4093 99.6719 105.4320 130.3703 133.2429 180.8955 200.5735 203.5074 217.7641 235.5008 245.9563 267.5513 273.9542 286.7860 296.1756 314.2118 347.1548 387.9299 407.2982 436.1349 441.6286 463.1130 475.1543 526.5985 550.7016 601.3871 618.0209 673.9219 692.3535 706.7745 756.4671 783.9396 802.6485 821.6186 848.5028 858.4523 867.6259 887.1699 913.7344 926.5458 942.3974 964.2252 968.1869 981.2649 988.1198 1001.9219 1015.7880 1051.6916 1055.3853 1070.4173 1077.8941 1085.6730 1102.7739 1111.7969 1114.1221 1123.4117 1146.1747 1156.3846 1175.9744 1185.3992 1205.1325 1219.4026 1236.4989 1245.3646 1279.7593 1283.7944 1301.0957 1308.8760 1312.4943 1318.3507 1331.6730 1352.1188 1371.8631 1382.3913 1386.5157 1414.0503 1428.6204 1442.0337 1450.4960 1454.1352 1464.3619 1465.1488 1469.7783 1470.7119 1474.5512 1475.7009 1485.1433 1487.9110 1488.2630 1596.1024 1602.6175 2900.4754 2919.2494 2937.7703 2957.1077 2976.7819 2978.8970 2998.8128 3016.8789 3030.7652 3044.8548 3051.3124 3066.7119 3072.8964 3076.7176 3083.0283 3085.4061 3093.2129 3121.3101 3129.3138 3153.6714 3170.2673 3173.9748 3560.4314
redmass: 3.3844 3.6148 3.4250 2.3146 3.1619 4.1333 3.3032 2.6275 2.6535 1.1531 1.6622 1.3716 3.2033 2.5701 1.9961 2.4227 1.2490 2.2188 3.4784 3.8400 1.9280 2.1702 3.4377 3.8313 3.1745 2.8062 3.7851 4.3708 3.9003 3.1918 4.0798 3.6741 2.1258 1.4575 1.6638 2.7158 3.9397 2.1284 1.8673 2.0191 1.4511 2.6736 2.6626 2.4012 2.2402 1.4926 3.1299 2.9326 4.4200 2.0714 2.6760 2.4450 1.6773 1.6583 1.8471 1.9666 2.0835 1.2638 1.4645 1.5921 1.3434 1.1638 1.8949 1.6178 1.3622 2.2613 1.9018 1.3537 1.1784 1.2846 1.5215 1.2893 1.4259 1.3241 1.3725 1.4677 7.1667 1.2357 2.2282 1.1470 1.3136 1.0843 1.1146 1.0737 1.0513 1.1082 1.2073 1.0589 1.0570 1.0900 1.6511 1.0737 6.5538 6.0555 1.0511 1.0836 1.0698 1.0331 1.0376 1.0659 1.0613 1.0604 1.0789 1.1036 1.0980 1.0985 1.0992 1.0968 1.1006 1.1006 1.1000 1.0995 1.0864 1.0921 1.0958 1.0915 1.0659
irintensity: 0.1098 1.2566 0.0148 0.1669 6.7078 1.7828 2.3207 0.3396 1.3510 0.5591 2.5476 1.8890 5.9794 4.3068 3.9439 3.1450 93.9741 54.8051 11.3240 7.6988 5.2746 2.8008 2.8150 2.7212 1.7555 13.2113 2.5328 2.3880 6.4741 4.7591 1.7009 10.9601 52.0500 3.2961 33.5917 6.8783 13.4761 3.5227 21.9920 31.6594 1.0366 40.0432 35.8949 3.5154 22.2902 10.1864 3.1822 1.6300 31.2943 25.7148 6.3300 25.8215 8.1849 8.1143 12.4392 15.3754 6.7827 0.2995 10.3129 16.6626 0.5411 13.2544 25.1341 27.0550 27.4590 28.1300 74.4735 10.6496 4.6985 4.4863 2.5103 1.3588 7.2264 2.3992 11.6980 2.2092 4.0785 20.7131 30.9575 4.5037 8.0393 3.2993 18.6906 5.1146 15.1494 10.9726 65.9519 6.0177 32.3118 9.2282 9.6514 13.0271 31.9507 125.1173 80.0124 55.6052 64.8650 54.8724 38.9817 68.3982 19.7924 20.9343 58.7710 44.9960 4.4862 17.7334 54.8893 1.2890 53.2477 40.5586 29.6533 29.8839 11.2115 18.7133 14.5400 1.3813 3.3158
temp: 298.150 k
press: 1.00000 atm
elementType: 8 8 7 6 6 6 6 6 6 6 6 6 6 6 6 6 6 6 1 1 1 1 1 1 1 1 1 1 1 1 1 1 1 1 1 1 1 1 1 1 1
symmnumber: 1
zpe: 922975.9 jmol-1
zpe.correction: 0.351543 hartree
zpe.thermalcorrener: 0.370559 hartree
zpe.thermalcorrenthalpy: 0.371503 hartree
zpe.thermalcorrgfe: 0.304112 hartree
zpe.sumelectzpe: -789.148673 hartree
zpe.sumelectthermal: -789.129658 hartree
zpe.sumelectthermalent: -789.128713 hartree
zpe.sumelectthermalfe: -789.196104 hartree
dipole: -1.7342 -0.2255 -0.5384
dipole: 1.8298
quadrupole: -111.4630 -114.6913 -100.2985
quadrupole: -1.9035 -7.7185 -2.1336
quadrupole: -2.6454 -5.8737 8.5191 -1.9035 -7.7185 -2.1336
hfenergy: -789.5002162 hartree
pointgroup: C01 [X(C15H23N1O2)]
dipole: -0.7052869 -0.0916471 -0.1114549 debye
polarizability: 198.3527083|-9.3265843|149.6389482|-3.0077359|6.7286932|169.1615389 unknown
InChI: InChI=1S/C15H23NO2/c1-4-14(17)15(8-9-16(2)11-15)12-6-5-7-13(10-12)18-3/h5-7,10,14,17H,4,8-9,11H2,1-3H3
charge 0 multiplicity 1
41 atoms
O  -0.614364 0.889453 -2.323625
O  3.597789 -1.188589 -0.646825
N  -2.852877 -1.869574 0.127071
C  -1.248235 0.052286 -0.007694
C  -2.352678 0.298549 1.083075
C  -1.769931 -1.290791 -0.706561
C  -1.313137 1.230016 -1.06089
C  -3.5165 -0.659178 0.686024
C  0.182646 -0.089421 0.543884
C  -0.682881 2.550171 -0.589244
C  -2.366622 -2.814554 1.16484
C  1.200634 -0.597679 -0.311723
C  0.548455 0.31812 1.851076
C  -1.036287 3.736612 -1.509232
C  2.535122 -0.708936 0.139884
C  1.886485 0.193453 2.299115
C  2.886722 -0.323783 1.457443
C  3.299652 -1.555695 -2.032671
H  -2.673265 1.35462 1.133213
H  -1.987228 0.013318 2.08345
H  -2.211348 -1.049013 -1.697429
H  -0.965411 -2.026819 -0.862577
H  -2.393621 1.394977 -1.28417
H  -4.175995 -0.923924 1.529707
H  -4.142619 -0.203622 -0.10709
H  -1.010339 2.758368 0.447482
H  0.413202 2.411934 -0.552631
H  -3.228983 -3.175224 1.75307
H  -1.614932 -2.385394 1.86843
H  -1.907708 -3.688326 0.670091
H  0.941729 -0.854363 -1.341613
H  -0.194876 0.74703 2.529446
H  -1.169627 0.249072 -2.835554
H  -2.125504 3.93568 -1.510772
H  -0.72555 3.520848 -2.54599
H  -0.525995 4.659877 -1.179567
H  2.148724 0.508717 3.315456
H  3.925766 -0.427566 1.783821
H  2.580092 -2.396855 -2.081969
H  4.263464 -1.868787 -2.460793
H  2.89873 -0.693806 -2.600559
