program: Gaussian 09
title: 000217423
version: EM64L-G09RevD.01
frameworkgroup: C1[X(C15H21NO2)]
method: RPBEPBE
basis: SDD
operation: Freq
keyword: #p
keyword: freq=noraman
keyword: PBEPBE/SDD
title: #p freq=noraman PBEPBE/SDD
converged: NO YES NO NO
title: Mulliken charges:
elementType: O O N C C C C C C C C C C C C C C C H H H H H H H H H H H H H H H H H H H H H
charge: -0.198251 -0.267105 -0.084188 0.166766 -0.525724 -0.492886 -0.408335 -0.504176 0.479829 -0.639680 0.192392 -0.533776 -0.405561 0.298140 -0.218282 -0.795664 -0.369763 -0.537975 0.224952 0.247743 0.241169 0.210498 0.199789 0.222411 0.241558 0.231685 0.226718 0.194113 0.225431 0.235040 0.231753 0.223923 0.235674 0.245271 0.274497 0.250341 0.220457 0.245190 0.216029
chargesum: 0.00000
title: Mulliken charges with hydrogens summed into heavy atoms:
elementType: O O N C C C C C C C C C C C C C C C
charge: -0.198251 -0.267105 -0.084188 0.166766 -0.053029 -0.041219 0.013866 -0.030933 0.479829 0.006581 0.192392 -0.298737 -0.173808 0.298140 0.005641 -0.040222 -0.119422 0.143700
polarizability: 2.15242705e+02 -2.26163036e+00 1.50623951e+02 1.30129951e+00 2.02532826e+01 1.50603890e+02
1716.lowfreq: -4.7589 -0.0008 0.0005 0.0008 4.3991 10.8199 25.2064 34.6109 62.7032
frequency: 23.5642 34.3579 62.6978 77.9851 82.6988 96.4048 104.2882 145.9411 151.7102 193.8285 201.4184 220.0196 231.7135 254.7212 265.4679 270.5116 302.7783 311.6031 327.9459 388.1329 404.7683 434.3311 449.3492 461.5992 506.8269 543.6344 561.3354 596.6782 630.9745 645.9759 700.4252 727.1049 785.1047 791.4112 815.6466 833.9178 847.8673 861.0181 884.1191 890.0187 923.0462 950.6427 972.1225 977.5247 984.0631 1000.7967 1001.7007 1015.2275 1031.3650 1052.8944 1083.2417 1093.8316 1112.0470 1112.5116 1127.4893 1155.4537 1156.1433 1170.8271 1179.7099 1190.6187 1198.5439 1213.6515 1215.8504 1238.3367 1247.8921 1270.3708 1285.1976 1306.0185 1321.2079 1338.8049 1348.1968 1368.1296 1388.4017 1419.2028 1432.7958 1440.9725 1445.2166 1446.7222 1458.5982 1465.3229 1465.9384 1470.0208 1475.6684 1478.2687 1488.5506 1491.9035 1504.8732 1601.9371 1608.3261 1629.0885 2854.2347 2862.7668 2898.1399 2953.6475 2968.0720 3002.5047 3009.5287 3011.8963 3017.8230 3025.9327 3039.3373 3050.4049 3072.3520 3073.6414 3080.5541 3114.9806 3121.0676 3134.1915 3144.6614 3159.3876 3172.5073
redmass: 4.0543 4.7353 5.3799 3.0965 2.3602 3.4325 3.5395 3.2904 2.3180 1.9831 1.6736 1.1604 1.5603 2.4951 2.5898 2.0798 4.0003 3.0872 2.9377 2.0972 2.4716 3.7807 3.5682 2.9385 3.0376 4.7517 3.3887 4.1864 4.2928 4.7913 1.9385 3.7790 2.8498 1.5015 3.7860 1.4178 4.0617 1.6995 2.0935 1.4570 2.8359 1.9834 1.3590 2.3717 4.6850 1.9730 2.9480 1.9085 2.3042 2.0698 1.6210 1.8595 1.3222 1.2610 2.2820 1.6525 1.3923 1.9219 1.2543 1.6181 1.3956 2.2161 2.3472 2.0287 1.4168 1.7242 1.5476 1.3188 1.5355 1.5056 1.5990 1.2497 7.6683 1.9213 1.1603 1.1234 1.4382 1.0717 1.0795 1.0507 1.0494 1.1791 1.0813 1.0596 1.9678 1.0922 1.0939 6.6802 6.0057 7.2729 1.0627 1.0640 1.0708 1.0332 1.0370 1.0887 1.0609 1.0596 1.0733 1.0889 1.1036 1.0949 1.1049 1.1012 1.1045 1.1012 1.0988 1.0868 1.0898 1.0921 1.0982
irintensity: 0.5529 2.2690 2.2295 2.2486 0.6860 6.4916 2.3702 1.5056 0.1307 2.0821 0.1283 1.7109 1.7897 1.2376 1.7464 0.5784 2.3245 8.4813 3.9868 1.4499 2.3722 1.7500 3.1028 2.5952 9.2487 7.4245 0.4519 1.1462 0.2224 1.0517 29.3447 7.9774 6.8361 35.4873 6.0490 3.7335 6.2099 23.3188 6.3124 2.5302 6.6370 10.2462 0.5323 0.2351 5.7150 13.6006 38.0013 10.6071 15.8014 5.5712 12.4206 7.0811 4.9827 0.2816 10.6661 65.1061 11.7608 16.2200 17.2278 8.6040 5.5012 21.2870 7.3306 90.7128 47.2332 40.5317 29.5134 4.5400 27.3595 10.2665 3.1640 67.9146 5.6493 33.8589 0.8383 14.9536 24.0221 5.9665 9.4666 15.4268 28.1934 72.3608 1.4529 4.6315 12.7014 5.3414 10.8482 35.8388 97.4906 109.0335 77.3235 137.7461 125.8221 55.8329 6.5402 36.6376 15.2817 37.0686 43.1886 24.7075 50.5838 6.0546 31.7780 27.8659 24.3860 10.2442 29.4508 11.1910 11.2516 15.2061 10.5237
temp: 298.150 k
press: 1.00000 atm
elementType: 8 8 7 6 6 6 6 6 6 6 6 6 6 6 6 6 6 6 1 1 1 1 1 1 1 1 1 1 1 1 1 1 1 1 1 1 1 1 1
symmnumber: 1
zpe: 862763.5 jmol-1
zpe.correction: 0.328609 hartree
zpe.thermalcorrener: 0.347170 hartree
zpe.thermalcorrenthalpy: 0.348114 hartree
zpe.thermalcorrgfe: 0.281300 hartree
zpe.sumelectzpe: -787.983021 hartree
zpe.sumelectthermal: -787.964461 hartree
zpe.sumelectthermalent: -787.963516 hartree
zpe.sumelectthermalfe: -788.030330 hartree
dipole: 2.3977 -3.9511 -1.1235
dipole: 4.7563
quadrupole: -103.6390 -114.9023 -100.0112
quadrupole: 3.2259 5.7691 6.6791
quadrupole: 2.5451 -8.7181 6.1730 3.2259 5.7691 6.6791
hfenergy: -788.3116302 hartree
pointgroup: C01 [X(C15H21N1O2)]
dipole: -1.1381528 -1.1385165 0.9539917 debye
polarizability: 214.5780619|-7.4009462|137.2635615|0.1190544|-14.7520764|164.6289225 unknown
InChI: InChI=1S/C15H21NO2/c1-12(17)10-15(7-8-16(2)11-15)13-5-4-6-14(9-13)18-3/h4-6,9H,7-8,10-11H2,1-3H3
charge 0 multiplicity 1
39 atoms
O  -0.31571 3.020763 -0.354978
O  4.143227 -0.851809 0.702621
N  -3.148402 -0.655425 0.053009
C  -0.834093 -0.155969 0.254469
C  -1.13898 -1.360354 1.216742
C  -1.971342 -0.346926 -0.787419
C  -2.680702 -1.575145 1.133974
C  -1.028866 1.179053 1.084898
C  0.572705 -0.211079 -0.351828
C  -4.34675 -1.103567 -0.668638
C  -1.264624 2.420512 0.219607
C  1.679486 -0.51961 0.485568
C  0.805686 0.059856 -1.719883
C  2.988826 -0.556529 -0.045436
C  2.120053 0.018336 -2.243956
C  -2.708849 2.895508 0.103294
C  3.215575 -0.289685 -1.418823
C  3.978697 -1.094253 2.135602
H  -0.800358 -1.159189 2.248209
H  -0.603995 -2.257219 0.857545
H  -2.161928 0.54535 -1.410805
H  -1.700097 -1.18722 -1.476015
H  -2.902244 -2.640038 0.885622
H  -3.200761 -1.341979 2.082463
H  -0.115888 1.33676 1.687549
H  -1.891646 1.040545 1.759199
H  -5.186595 -1.229227 0.038287
H  -4.199288 -2.075961 -1.203663
H  -4.644096 -0.34501 -1.415182
H  1.506776 -0.728027 1.546727
H  -0.025409 0.323956 -2.380497
H  2.28957 0.237624 -3.303879
H  -3.000394 3.39346 1.05019
H  -2.818364 3.617458 -0.721503
H  -3.389468 2.032316 -0.018437
H  4.239715 -0.322866 -1.802205
H  3.547877 -0.211439 2.64806
H  4.994062 -1.28239 2.514796
H  3.341197 -1.980279 2.327016
