program: Gaussian 09
title: 000217421
version: EM64L-G09RevD.01
frameworkgroup: C1[X(C15H21NO)]
method: RPBEPBE
basis: SDD
operation: Freq
keyword: #p
keyword: freq=noraman
keyword: PBEPBE/SDD
title: #p freq=noraman PBEPBE/SDD
converged: NO YES NO NO
title: Mulliken charges:
elementType: O N C C C C C C C C C C C C C C C H H H H H H H H H H H H H H H H H H H H H
charge: -0.275234 -0.023947 0.256019 -0.554056 -0.519141 -0.469910 -0.586847 0.467384 -0.638937 -0.550827 -0.448970 -0.006626 0.331583 -0.234446 -0.391651 -0.612303 -0.536862 0.240688 0.223305 0.208868 0.248306 0.216085 0.232964 0.216539 0.222639 0.222492 0.230792 0.204667 0.267903 0.242228 0.239452 0.220793 0.242667 0.214302 0.216668 0.219916 0.219888 0.243607
chargesum: 0.00000
title: Mulliken charges with hydrogens summed into heavy atoms:
elementType: O N C C C C C C C C C C C C C C C
charge: -0.275234 -0.023947 0.256019 -0.090062 -0.061967 -0.020861 -0.147669 0.467384 0.019014 -0.282923 -0.206743 0.232826 0.331583 -0.013653 -0.148984 -0.181333 0.146549
polarizability: 2.15774732e+02 -1.23189310e+01 1.50280785e+02 1.42134250e+00 1.66933369e+01 1.45503510e+02
1716.lowfreq: -10.3676 -0.0005 0.0005 0.0007 2.0198 12.2062 31.2226 36.3053 58.6430
frequency: 31.1045 35.6151 58.5948 78.1132 83.9818 127.0660 131.8821 148.8796 192.2208 205.8034 226.9956 248.4858 251.3815 265.9909 296.6637 331.9529 345.8375 390.4548 405.7279 429.3665 448.5244 478.8384 486.4361 548.7468 602.0967 604.3632 620.7533 670.2756 702.1916 711.6771 781.8632 790.6298 808.0619 865.3760 873.8609 877.0767 883.0438 892.2525 931.2401 941.5424 949.0432 964.8857 973.8255 984.6072 994.6969 1007.4301 1009.9584 1026.3092 1057.0645 1064.4449 1094.1316 1106.2925 1110.6121 1117.0799 1123.3028 1141.6764 1160.1109 1181.4742 1187.1463 1204.5277 1233.5328 1237.8006 1263.3032 1285.0081 1289.0493 1297.9285 1303.1856 1310.2174 1326.0413 1330.9333 1384.0366 1423.7800 1425.7072 1427.8028 1438.8366 1450.2954 1464.0415 1465.1601 1466.7723 1473.5683 1474.1635 1474.9600 1481.1552 1485.0381 1581.7482 1615.6208 1653.3038 2881.9760 2957.0684 2959.7558 2979.2043 2998.9553 3004.1803 3022.7317 3025.3649 3043.8316 3061.8160 3072.9151 3079.8898 3080.9844 3084.3820 3099.8597 3122.5532 3127.2446 3152.5098 3157.4357 3167.2046 3189.9627
redmass: 3.8865 3.2608 3.3223 3.0216 3.2362 2.6893 3.6213 2.8580 1.0852 1.6197 2.4070 2.7907 3.0688 1.9994 3.5968 2.8892 2.3441 2.1033 2.5875 2.3292 2.6177 2.7196 3.4194 4.5917 2.4576 2.6902 3.7805 2.8382 3.8991 2.0645 1.8300 2.7973 3.9881 2.0860 1.7129 1.6997 1.9359 1.5357 2.4337 1.3596 2.0477 1.3159 2.5088 4.6730 1.9865 2.8795 1.2165 2.1016 2.9771 2.2389 1.8026 1.8032 1.2620 1.7726 1.4867 1.5641 1.4123 1.2842 1.5374 1.7707 1.7844 1.8340 1.4351 1.3563 1.5121 1.2907 1.3352 1.4314 1.2261 1.4923 7.7343 1.6079 1.3200 1.1529 1.4912 1.1257 1.0679 1.0510 1.0838 1.3676 1.1343 1.0876 1.4340 1.0733 5.8638 6.6299 4.6094 1.0535 1.0330 1.0591 1.0660 1.0653 1.0608 1.1009 1.0761 1.1038 1.1007 1.1022 1.0990 1.0623 1.0990 1.0933 1.0990 1.0865 1.0915 1.0908 1.0969 1.1141
irintensity: 0.0310 0.0557 0.8001 1.3489 6.7132 0.0493 0.5229 0.8672 0.0398 0.3992 1.1107 1.1366 3.1641 0.6037 0.2003 0.7793 2.9290 5.1920 1.4166 3.0324 2.7767 1.4433 0.1930 7.3931 6.1656 8.9133 3.6468 14.7935 15.0088 41.8615 37.8938 6.6016 4.9762 20.7329 1.5767 11.1656 7.7883 11.2524 0.7886 66.5267 19.2774 0.9924 24.0280 2.1850 4.5669 46.3780 28.9357 35.5347 17.9158 7.1963 1.0203 6.7959 0.2050 5.0492 14.9309 14.7693 10.7873 29.5024 5.6426 28.5603 49.1936 25.2798 4.9985 1.4337 16.4156 9.5140 5.2999 6.1594 3.6693 12.1069 14.9193 11.0252 34.1501 3.0595 6.0714 13.7436 11.1813 13.4176 14.2315 1.9693 24.6432 36.0656 37.5228 4.9185 67.9191 111.0268 13.1526 87.8712 75.4657 21.5794 51.1825 38.3202 15.0307 29.3836 62.1380 49.4777 24.9544 15.7799 41.8909 20.2146 37.0614 11.0653 27.5385 7.0266 19.3402 5.5225 12.2153 27.9105
temp: 298.150 k
press: 1.00000 atm
elementType: 8 7 6 6 6 6 6 6 6 6 6 6 6 6 6 6 6 1 1 1 1 1 1 1 1 1 1 1 1 1 1 1 1 1 1 1 1 1
symmnumber: 1
zpe: 852915.9 jmol-1
zpe.correction: 0.324859 hartree
zpe.thermalcorrener: 0.342116 hartree
zpe.thermalcorrenthalpy: 0.343060 hartree
zpe.thermalcorrgfe: 0.279373 hartree
zpe.sumelectzpe: -712.812970 hartree
zpe.sumelectthermal: -712.795713 hartree
zpe.sumelectthermalent: -712.794769 hartree
zpe.sumelectthermalfe: -712.858455 hartree
dipole: 2.5307 -0.0628 0.2517
dipole: 2.5440
quadrupole: -93.3984 -103.7228 -101.3507
quadrupole: -0.4865 5.9286 3.6530
quadrupole: 6.0922 -4.2321 -1.8601 -0.4865 5.9286 3.6530
hfenergy: -713.1378283 hartree
pointgroup: C01 [X(C15H21N1O1)]
dipole: 0.9230351 -0.371926 0.1068632 debye
polarizability: 200.183525|-32.8713954|156.7807014|4.1339866|14.6762901|154.5948008 unknown
InChI: InChI=1S/C15H21NO/c1-4-8-15(9-10-16(2)12-15)13-6-5-7-14(11-13)17-3/h4-7,11H,1,8-10,12H2,2-3H3
charge 0 multiplicity 1
38 atoms
O  3.316685 -1.566191 -1.101983
N  -3.352297 -0.637459 0.052557
C  -1.126087 0.445798 -0.342326
C  -1.605264 -0.372118 -1.596599
C  -2.364504 0.306062 0.652807
C  -3.146128 -0.464672 -1.41381
C  -0.964441 1.956799 -0.780906
C  0.212824 -0.053413 0.230132
C  -3.179997 -2.041009 0.504986
C  1.190878 -0.60751 -0.62834
C  0.542352 0.093693 1.608638
C  -0.6614 2.933977 0.333722
C  2.449933 -1.027081 -0.134201
C  1.796721 -0.324216 2.096759
C  2.766314 -0.892925 1.23889
C  -1.442336 3.990522 0.676025
C  4.633073 -2.020663 -0.650943
H  -1.172313 -1.388557 -1.584349
H  -1.315924 0.109161 -2.548471
H  -2.076118 -0.04998 1.654932
H  -2.842506 1.296672 0.77207
H  -3.632222 0.4792 -1.731251
H  -3.608825 -1.292754 -1.977146
H  -1.895502 2.263599 -1.29747
H  -0.144223 1.996379 -1.527328
H  -3.932257 -2.675726 0.003291
H  -3.365844 -2.096164 1.591969
H  -2.169673 -2.474015 0.307683
H  1.004099 -0.728584 -1.699881
H  -0.177722 0.538379 2.302683
H  0.275707 2.762744 0.883548
H  2.02891 -0.207111 3.16159
H  3.732154 -1.213413 1.640026
H  -1.16039 4.675907 1.483677
H  -2.38359 4.205807 0.153746
H  4.545844 -2.835776 0.094081
H  5.222496 -1.187795 -0.219748
H  5.132576 -2.397962 -1.555459
