program: Gaussian 09
title: 000217416
version: EM64L-G09RevD.01
frameworkgroup: C1[X(C23H31NO2)]
method: RPBEPBE
basis: SDD
operation: Freq
keyword: #p
keyword: freq=noraman
keyword: PBEPBE/SDD
title: #p freq=noraman PBEPBE/SDD
converged: NO YES NO NO
title: Mulliken charges:
elementType: O O N C C C C C C C C C C C C C C C C C C C C C C C H H H H H H H H H H H H H H H H H H H H H H H H H H H H H H H
charge: -0.441808 -0.436547 -0.036356 0.301401 -0.554030 -0.580604 -0.509351 -0.462289 0.297662 0.487249 -0.353709 -0.721832 -0.737986 -0.710240 -0.555969 -0.451520 -0.575144 0.282614 -0.215306 0.517042 -0.422644 -0.391843 -0.390688 -0.348800 -0.386955 0.277150 0.237239 0.237541 0.235414 0.236419 0.207579 0.195407 0.220395 0.226440 0.190119 0.221454 0.214196 0.204326 0.212618 0.229975 0.193486 0.208395 0.206611 0.199006 0.247394 0.258796 0.232775 0.203419 0.225115 0.223144 0.220619 0.236388 0.227344 0.353720 0.248089 0.215762 0.351320
chargesum: 0.00000
title: Mulliken charges with hydrogens summed into heavy atoms:
elementType: O O N C C C C C C C C C C C C C C C C C C C C C C C
charge: -0.088088 -0.085227 -0.036356 0.301401 -0.079250 -0.108771 -0.106365 -0.015454 0.297662 0.487249 0.057864 -0.090691 -0.106129 -0.057229 -0.297174 -0.218745 -0.146611 0.282614 0.007838 0.517042 -0.202024 -0.155455 -0.163345 -0.100711 -0.171193 0.277150
polarizability: 3.52154847e+02 8.79937068e+00 2.26571077e+02 -1.60840189e+01 -4.38094290e+00 2.01057588e+02
1716.lowfreq: -12.0253 -0.0008 -0.0004 0.0001 2.0695 5.0890 14.1622 18.6034 23.7062
frequency: 13.4993 17.9990 23.6781 34.3850 47.2253 55.3737 71.4728 75.2774 84.9254 147.1725 165.5163 176.5610 183.1332 204.6688 223.7795 231.1118 236.3810 250.1198 266.3959 294.3750 295.8764 306.5947 312.2979 335.6334 346.1640 349.0422 356.0420 364.5603 378.1007 381.0999 405.1614 411.6735 421.5699 429.9866 450.1134 459.1421 481.2947 491.6513 517.4738 526.4738 537.2912 592.1923 636.6102 636.9223 649.3844 696.5154 707.4631 717.7216 732.2227 756.7834 777.7101 787.6051 795.7685 802.0365 817.5810 827.4346 851.7472 858.7329 863.7878 872.4288 885.1944 896.0387 914.1865 926.2908 929.4353 935.2897 938.2088 957.5667 959.2999 960.9418 971.3615 984.7350 999.9547 1004.0562 1008.3517 1015.4741 1027.7855 1041.7551 1059.0518 1071.2924 1090.6552 1093.8228 1099.3519 1120.8719 1141.7092 1143.5935 1159.0014 1177.8833 1178.7106 1185.0214 1191.0800 1203.0673 1214.8249 1222.1405 1226.7683 1245.2497 1248.6551 1262.6640 1276.6193 1287.4359 1291.8155 1300.6155 1308.0267 1318.3725 1318.9232 1326.7054 1338.4419 1348.6420 1362.1759 1369.6764 1372.7087 1380.4469 1390.4013 1399.5468 1425.0947 1449.7426 1456.2677 1458.1128 1460.7425 1465.7262 1466.3164 1467.3982 1470.7947 1474.8421 1480.3629 1484.9649 1486.1868 1487.9700 1498.6591 1504.0529 1585.8700 1597.7170 1624.6500 1626.5785 2882.5210 2952.7958 2959.8859 2965.1172 2974.4443 2980.1552 2989.7186 2994.0323 3005.1054 3012.0140 3020.3079 3049.8636 3056.8256 3057.4514 3057.5933 3065.9428 3066.6859 3076.3552 3077.6032 3100.0078 3105.1480 3111.8380 3115.5115 3124.0598 3130.6253 3139.9706 3152.2623 3165.2305 3168.4990 3582.2775 3583.0275
redmass: 5.0378 3.6911 5.4244 3.7732 5.1450 2.8772 4.1933 4.5680 3.5644 2.7922 4.2589 3.6676 2.7788 2.7325 1.7308 2.1279 2.0710 2.5299 2.0538 1.7802 2.0638 3.5328 1.1473 2.8078 1.1344 2.2837 1.2014 2.7444 2.4871 2.4025 3.0254 2.9240 1.8530 3.0223 3.0129 3.1120 2.5326 4.4481 3.8246 4.9851 2.7853 2.9082 4.4849 6.6733 3.5237 4.0412 2.0121 3.6815 3.6046 4.3712 1.6330 1.2116 3.3468 1.4935 3.7297 1.7440 2.3685 1.9763 2.2485 1.8571 1.9917 1.7948 1.8554 1.8375 1.3911 1.7317 1.2790 1.8527 1.4443 1.4508 2.0738 5.6835 2.3858 2.6397 2.0007 1.7365 1.6393 3.1433 1.9586 2.6940 1.7677 1.7805 1.6045 1.7361 1.4818 1.3767 1.5248 1.1660 1.2819 1.1974 1.3997 2.3660 2.0432 1.4587 1.9386 2.8893 3.0819 2.7062 1.5162 1.2874 1.3473 1.3177 1.3471 1.3171 1.2841 1.4765 1.3072 1.3216 1.3195 1.2045 1.1994 6.7313 6.1777 1.2089 2.8170 1.1388 2.0079 1.0782 1.0888 1.0803 1.1428 1.0652 1.0957 1.2414 1.7163 1.0716 1.0853 1.0922 1.0605 2.7693 6.2074 6.4497 6.2722 6.4727 1.0680 1.0583 1.0352 1.0366 1.0383 1.0665 1.0618 1.0636 1.0685 1.0982 1.0882 1.0988 1.0998 1.1004 1.0999 1.0986 1.0972 1.0983 1.1015 1.0969 1.0870 1.0949 1.0879 1.0903 1.0960 1.0918 1.0908 1.0958 1.0952 1.0660 1.0660
irintensity: 0.0175 0.7962 0.0037 0.6576 0.0432 0.0253 0.3008 0.6262 0.2530 0.2196 1.0071 1.7045 2.9757 1.4729 0.6862 0.8443 0.1229 1.2225 0.4977 2.1013 2.2147 1.3787 0.5955 1.5329 136.9056 23.2840 117.2092 3.2734 1.5338 2.5827 9.6968 1.0970 1.1425 4.2967 1.7942 3.5745 0.1644 15.7602 6.2692 2.9466 33.9596 3.3575 9.0269 0.3354 1.0056 16.2862 29.7850 0.8107 1.4117 5.6747 47.0827 0.8933 4.0765 31.0672 13.8740 17.6228 6.6229 40.9541 6.6136 26.1859 7.6557 27.3388 17.7547 6.8422 0.4764 11.3455 2.0821 3.6363 0.4670 1.0316 1.2749 3.4441 23.2339 3.3580 2.4529 3.3046 0.4900 27.3652 5.1231 4.2790 61.1631 12.8941 9.1988 48.4967 139.9799 183.2973 82.0385 7.7177 1.8165 3.9566 2.2714 14.5931 2.7075 9.1833 1.5115 28.8041 9.3281 46.6379 2.2865 3.6107 5.6748 6.7108 5.3475 5.6579 25.1409 6.9682 3.1988 11.1717 18.3955 20.7293 13.6069 9.6807 12.4198 16.0822 12.2469 1.5325 1.7973 1.6688 4.6105 2.0595 15.0618 6.5962 12.7893 18.1120 23.6192 7.9603 13.7680 11.4333 22.2290 113.8318 62.9491 11.6238 83.6618 27.6943 64.0723 23.5474 36.7255 43.7071 30.1670 52.4605 18.0541 36.5153 34.1403 48.6195 11.3838 19.1630 84.5354 18.0256 8.2781 101.1320 15.9716 36.2031 58.6091 23.1806 26.3104 19.3551 12.8798 21.0031 15.2377 25.9294 5.2842 11.0821 7.8109 38.9688 34.2675
temp: 298.150 k
press: 1.00000 atm
elementType: 8 8 7 6 6 6 6 6 6 6 6 6 6 6 6 6 6 6 6 6 6 6 6 6 6 6 1 1 1 1 1 1 1 1 1 1 1 1 1 1 1 1 1 1 1 1 1 1 1 1 1 1 1 1 1 1 1
symmnumber: 1
zpe: 1277119.8 jmol-1
zpe.correction: 0.486429 hartree
zpe.thermalcorrener: 0.512493 hartree
zpe.thermalcorrenthalpy: 0.513437 hartree
zpe.thermalcorrgfe: 0.428709 hartree
zpe.sumelectzpe: -1098.251022 hartree
zpe.sumelectthermal: -1098.224958 hartree
zpe.sumelectthermalent: -1098.224014 hartree
zpe.sumelectthermalfe: -1098.308742 hartree
dipole: -2.3296 1.9565 0.2579
dipole: 3.0531
quadrupole: -148.0803 -153.1075 -160.4815
quadrupole: 10.6680 -7.9514 0.3392
quadrupole: 5.8095 0.7823 -6.5918 10.6680 -7.9514 0.3392
hfenergy: -1098.7374511 hartree
pointgroup: C01 [X(C23H31N1O2)]
dipole: -0.9934626 -0.5114254 -0.4408303 debye
polarizability: 341.151738|-34.8949112|234.8304963|22.1453724|0.806669|203.8012765 unknown
InChI: InChI=1S/C23H31NO2/c1-22(2,3)16-23(19-5-4-6-21(26)15-19)12-14-24(17-23)13-11-18-7-9-20(25)10-8-18/h4-10,15,25-26H,11-14,16-17H2,1-3H3
charge 0 multiplicity 1
57 atoms
O  -6.416811 0.609381 1.411365
O  7.2900 -2.575232 1.095083
N  0.600038 1.674029 0.58765
C  -1.568592 0.419639 0.431935
C  -1.266416 0.889223 1.916887
C  -0.411998 1.160112 -0.378305
C  -1.416231 -1.154261 0.408268
C  -0.22358 2.031786 1.775082
C  -1.733537 -2.056375 -0.838896
C  -2.989804 0.837718 -0.006622
C  1.74382 0.771771 0.877687
C  -1.155591 -3.463214 -0.49763
C  -1.069547 -1.570341 -2.153487
C  -3.26097 -2.218464 -1.077103
C  -4.084451 0.582313 0.857746
C  -3.267491 1.426188 -1.271538
C  2.764956 0.735125 -0.291757
C  -5.403252 0.90645 0.478708
C  -4.590045 1.751806 -1.645559
C  3.960206 -0.147798 0.031114
C  -5.673764 1.498061 -0.778136
C  5.113076 0.386106 0.666324
C  3.941123 -1.537805 -0.246072
C  6.209226 -0.428617 1.014091
C  5.029252 -2.372158 0.094203
C  6.164305 -1.811995 0.72731
H  -0.827238 0.05179 2.491921
H  -2.173995 1.221807 2.446264
H  0.066122 0.513218 -1.127149
H  -0.832418 2.035783 -0.905024
H  -2.042119 -1.549534 1.236533
H  -0.365737 -1.357593 0.701004
H  -0.73769 2.991815 1.57086
H  0.40866 2.166062 2.669569
H  1.446382 -0.277558 1.12128
H  2.257819 1.168611 1.773559
H  -1.594589 -3.85879 0.438281
H  -0.056543 -3.425036 -0.367651
H  -1.379013 -4.183767 -1.306973
H  -1.46663 -0.591318 -2.474604
H  0.030259 -1.488734 -2.052419
H  -1.274942 -2.29486 -2.964749
H  -3.775512 -2.533297 -0.149688
H  -3.4415 -2.994252 -1.846296
H  -3.729254 -1.282826 -1.422305
H  -3.938711 0.112927 1.835741
H  -2.460157 1.627804 -1.980902
H  2.258967 0.368144 -1.205559
H  3.07876 1.775558 -0.494098
H  -4.77983 2.205949 -2.624573
H  -6.699792 1.754198 -1.072572
H  5.154975 1.45994 0.886592
H  3.067472 -1.976425 -0.744586
H  -7.303321 0.873998 1.061121
H  7.09986 -0.016579 1.497853
H  4.994629 -3.445629 -0.135437
H  7.163761 -3.525157 0.84946
