program: Gaussian 09
title: 000217414
version: EM64L-G09RevD.01
frameworkgroup: C1[X(C14H19NO)]
method: RPBEPBE
basis: SDD
operation: Freq
keyword: #p
keyword: freq=noraman
keyword: PBEPBE/SDD
title: #p freq=noraman PBEPBE/SDD
converged: YES YES NO NO
title: Mulliken charges:
elementType: O N C C C C C C C C C C C C C C H H H H H H H H H H H H H H H H H H H
charge: -0.442058 -0.024362 0.256476 -0.553552 -0.517910 -0.468692 -0.587258 0.473850 -0.638453 -0.536702 -0.455822 -0.006404 0.291630 -0.208112 -0.420592 -0.610850 0.223839 0.241245 0.248785 0.207553 0.233281 0.216444 0.223637 0.217185 0.204581 0.230733 0.222963 0.269090 0.240940 0.238571 0.223483 0.221102 0.214712 0.216753 0.353913
chargesum: 0.00000
title: Mulliken charges with hydrogens summed into heavy atoms:
elementType: O N C C C C C C C C C C C C C C
charge: -0.088145 -0.024362 0.256476 -0.088468 -0.061572 -0.018966 -0.146437 0.473850 0.019824 -0.267611 -0.214882 0.232168 0.291630 0.015371 -0.199490 -0.179385
polarizability: 1.92403411e+02 1.23911825e+01 1.40622683e+02 -3.64926660e+00 1.64821972e+01 1.38656130e+02
1716.lowfreq: -12.0802 -0.0004 -0.0002 0.0003 3.4569 12.8054 29.5146 36.4191 63.6035
frequency: 28.5605 36.1466 63.6005 82.3446 123.1276 139.6028 162.3217 205.7564 220.2966 233.7479 253.2983 298.9370 317.0954 346.0621 359.5023 386.1216 398.3623 423.1941 449.2128 467.5638 482.5996 523.2437 600.8315 602.4908 620.6073 667.9330 702.7456 708.4938 778.4076 796.5138 818.4606 865.8071 868.9225 875.8259 890.7324 903.3650 932.4917 943.4277 948.7967 959.4429 980.7165 986.4024 994.5161 1011.3088 1020.5674 1055.5961 1062.8919 1090.7361 1103.8628 1116.1481 1122.6882 1142.5821 1152.5466 1181.1794 1186.5428 1207.6512 1234.8087 1245.8120 1264.0474 1283.5882 1290.3025 1299.7874 1303.7911 1311.3334 1327.1045 1328.7194 1381.5224 1426.1134 1427.2329 1449.1739 1457.7672 1463.9712 1467.2447 1473.1458 1474.0158 1482.0967 1483.6203 1586.4961 1624.6578 1654.2839 2880.3433 2959.8695 2980.2195 3000.3524 3002.9312 3023.1059 3026.0664 3060.8318 3072.5568 3079.9296 3082.0488 3084.6769 3102.0066 3115.7880 3138.7985 3159.5457 3164.2161 3190.8542 3583.2122
redmass: 3.1367 4.7950 3.5078 3.0573 2.9007 2.7181 3.5751 1.1331 2.8523 3.1859 2.9540 3.8048 3.0537 2.3161 1.1164 2.9633 2.0013 2.1675 2.6627 3.0825 2.4828 6.9024 2.8362 2.4388 3.4870 2.7583 3.3167 2.1760 1.6431 3.6006 3.5957 2.0793 1.4727 1.6166 1.5298 2.5244 2.3693 1.3698 2.0599 1.3209 2.4199 4.2501 1.9728 1.1947 1.8207 2.7507 2.2373 1.8301 1.7948 1.7584 1.4914 1.5268 1.4412 1.1057 1.6217 1.7929 1.5060 1.8495 1.5015 1.3706 1.5878 1.3108 1.2854 1.4395 1.3939 1.3269 7.4123 1.1630 1.1565 1.1600 2.5648 1.0751 1.0900 1.0698 1.5601 1.4142 1.0688 6.2908 6.2760 4.5963 1.0538 1.0591 1.0658 1.0630 1.0628 1.1006 1.0760 1.1009 1.1023 1.1005 1.0610 1.0991 1.0932 1.0878 1.0912 1.0927 1.0948 1.1142 1.0660
irintensity: 0.0784 0.3603 0.2652 0.3246 3.4560 0.1789 1.8765 0.0558 2.0336 0.5940 1.8870 2.2554 2.3647 0.9873 136.8930 11.9520 1.0753 1.2338 1.9123 5.1782 1.9163 2.0651 12.0674 4.4976 2.8905 14.7200 17.4717 40.3108 42.8680 1.5527 6.4823 23.4507 0.0665 7.4344 6.5019 71.3816 6.6141 65.2121 25.8976 0.6140 8.4258 2.2040 5.0969 21.3353 17.0351 14.7214 7.6959 3.6512 5.6862 1.3460 15.1240 56.9113 123.3256 5.7091 5.4274 3.7177 1.2082 10.4605 1.5183 1.1700 14.8311 17.9910 14.6305 0.9198 12.2000 4.8115 9.7427 9.5732 3.0401 11.2870 9.5759 10.6966 14.2831 20.8476 18.0741 31.7366 4.9087 69.4883 80.0836 12.9153 88.0744 22.0398 51.1012 46.3775 6.2241 28.2100 61.4045 25.4868 18.0607 40.4765 15.9625 37.6880 11.2145 11.5750 22.1295 13.8375 2.8508 27.7134 34.6038
temp: 298.150 k
press: 1.00000 atm
elementType: 8 7 6 6 6 6 6 6 6 6 6 6 6 6 6 6 1 1 1 1 1 1 1 1 1 1 1 1 1 1 1 1 1 1 1
symmnumber: 1
zpe: 779665.7 jmol-1
zpe.correction: 0.296959 hartree
zpe.thermalcorrener: 0.312728 hartree
zpe.thermalcorrenthalpy: 0.313672 hartree
zpe.thermalcorrgfe: 0.253483 hartree
zpe.sumelectzpe: -673.602338 hartree
zpe.sumelectthermal: -673.586569 hartree
zpe.sumelectthermalent: -673.585625 hartree
zpe.sumelectthermalfe: -673.645814 hartree
dipole: -2.0108 -0.0530 0.4966
dipole: 2.0718
quadrupole: -88.3456 -97.9627 -96.0733
quadrupole: 0.3177 -7.8373 2.6538
quadrupole: 5.7816 -3.8355 -1.9461 0.3177 -7.8373 2.6538
hfenergy: -673.8992972 hartree
pointgroup: C01 [X(C14H19N1O1)]
dipole: 0.7577753 0.1572543 0.2558851 debye
polarizability: 185.796535|21.5918535|144.4934856|9.3766344|-14.1004049|141.3922022 unknown
InChI: InChI=1S/C14H19NO/c1-3-7-14(8-9-15(2)11-14)12-5-4-6-13(16)10-12/h3-6,10,16H,1,7-9,11H2,2H3
charge 0 multiplicity 1
35 atoms
O  3.673141 1.539676 -1.054313
N  -3.028757 1.03963 0.336681
C  -0.933459 -0.143809 -0.366638
C  -1.388369 0.91582 -1.435657
C  -2.110752 -0.077171 0.706098
C  -2.903394 1.111159 -1.147405
C  -0.925399 -1.565573 -1.058682
C  0.470168 0.139295 0.199317
C  -2.701799 2.321039 1.011766
C  1.45925 0.722969 -0.631094
C  0.843891 -0.23735 1.520322
C  -0.66854 -2.73804 -0.137061
C  2.768185 0.946205 -0.152201
C  2.154625 -0.011353 1.992958
C  3.13141 0.586074 1.166568
C  -1.526059 -3.771324 0.062807
H  -1.191221 0.580454 -2.470103
H  -0.857363 1.872357 -1.281203
H  -2.674862 -1.028323 0.678252
H  -1.750453 0.068124 1.737094
H  -3.306256 2.063946 -1.530955
H  -3.493807 0.286281 -1.593407
H  -0.141837 -1.54543 -1.844205
H  -1.899439 -1.703148 -1.568691
H  -1.66386 2.691827 0.831101
H  -2.83364 2.199834 2.101292
H  -3.410429 3.097608 0.672412
H  1.236684 1.016338 -1.661349
H  0.115639 -0.713147 2.184212
H  0.298025 -2.736384 0.387922
H  2.420974 -0.303978 3.014799
H  4.14832 0.763414 1.539941
H  -1.278417 -4.603957 0.731302
H  -2.499208 -3.818146 -0.442897
H  4.561407 1.655478 -0.634586
