program: Gaussian 09
title: 000217413
version: EM64L-G09RevD.01
frameworkgroup: C1[X(C16H25NO)]
method: RPBEPBE
basis: SDD
operation: Freq
keyword: #p
keyword: freq=noraman
keyword: PBEPBE/SDD
title: #p freq=noraman PBEPBE/SDD
converged: YES YES NO NO
title: Mulliken charges:
elementType: O N C C C C C C C C C C C C C C C C H H H H H H H H H H H H H H H H H H H H H H H H H
charge: -0.442050 -0.029643 0.276490 -0.550489 -0.557317 -0.527911 -0.462702 0.009333 0.480931 -0.363948 -0.634868 -0.756730 -0.528356 -0.447471 -0.721060 0.279801 -0.214582 -0.421853 0.244565 0.223085 0.209626 0.242094 0.205217 0.200781 0.217989 0.229084 0.215197 0.195175 0.192280 0.212639 0.221915 0.224526 0.201344 0.222274 0.230271 0.267375 0.217960 0.212874 0.214333 0.216316 0.222087 0.219947 0.353473
chargesum: 0.00000
title: Mulliken charges with hydrogens summed into heavy atoms:
elementType: O N C C C C C C C C C C C C C C C C
charge: -0.088576 -0.029643 0.276490 -0.082839 -0.105596 -0.121913 -0.015629 0.224530 0.480931 0.023506 0.024212 -0.102841 -0.260981 -0.229511 -0.077537 0.279801 0.007505 -0.201905
polarizability: 1.64633967e+02 5.94755772e+00 2.00934731e+02 -1.73169220e+00 3.18943391e+00 1.67680548e+02
1716.lowfreq: -9.3043 -0.0007 -0.0006 -0.0004 7.9896 14.3860 20.9729 31.7556 47.0899
frequency: 19.0849 30.0870 46.9849 62.8292 88.4231 100.3471 141.4976 161.5484 171.3818 202.2542 217.1949 223.2085 224.9494 231.7705 274.4491 295.8101 306.5012 329.5919 353.0886 361.3365 397.7923 404.0878 423.4957 445.2900 457.9468 492.6434 512.9065 529.6087 603.4426 619.4881 654.4038 699.4056 702.4326 764.5776 775.0990 784.8494 807.8319 818.5597 859.1067 861.7809 874.0815 885.6340 894.0387 917.0981 946.2047 954.4526 959.5144 974.4324 983.3998 987.7990 1009.0870 1024.0859 1042.4441 1050.8236 1066.5353 1094.5405 1103.7998 1121.3115 1124.3725 1141.3280 1143.4448 1151.9077 1159.2924 1182.7260 1189.9200 1209.0501 1231.9997 1245.6037 1262.1528 1266.8054 1283.3049 1292.3678 1306.1424 1308.1003 1320.3883 1326.5182 1335.4879 1342.4011 1353.1840 1380.4993 1384.7251 1391.5611 1427.6721 1446.9773 1456.2657 1462.6881 1464.4095 1465.6875 1472.3395 1473.5456 1475.6608 1479.1249 1480.8495 1483.7027 1486.4719 1500.7197 1586.3957 1624.5899 2893.8037 2942.9867 2952.7363 2969.5303 2974.5499 2976.9241 2982.2667 2999.3565 3003.5639 3007.4100 3014.5214 3025.9496 3061.1758 3064.0518 3067.6747 3075.0492 3075.2614 3080.7108 3086.5547 3091.9743 3115.1217 3137.7643 3153.8001 3161.4878 3582.8871
redmass: 4.4119 3.0081 3.6658 2.5393 2.2717 3.0568 2.8744 2.5989 3.2726 1.2403 2.0282 1.6097 1.9836 2.0382 2.2884 1.8414 3.8054 2.2520 1.1247 3.9191 2.1050 1.9966 1.9074 3.2691 2.8221 2.5119 3.4378 4.2625 4.3510 3.0769 4.4907 2.9658 2.2910 1.2924 1.7459 2.8835 2.2414 3.0134 1.9664 1.6763 1.5978 1.7130 2.0743 2.1456 2.3671 1.2724 1.2942 2.0591 3.7520 2.7148 1.8233 1.8434 2.6221 2.9477 1.9505 1.8355 1.8702 1.7121 1.5537 1.5499 2.2621 1.4377 1.8744 1.1668 1.6358 1.5102 1.6689 1.7759 1.5551 1.2806 1.2244 1.7116 1.3279 1.1919 1.4415 1.3910 1.4574 1.3785 1.3688 5.6254 1.2933 1.2047 1.1500 1.1692 2.2306 1.0879 1.1045 1.0786 1.1066 1.0810 1.0952 1.5847 1.1605 1.1246 1.0596 1.0490 6.2545 6.2506 1.0517 1.0604 1.0620 1.0698 1.0399 1.0450 1.0654 1.0831 1.0836 1.0628 1.0977 1.0779 1.1005 1.0980 1.0990 1.1031 1.0990 1.1016 1.0968 1.0979 1.0877 1.0909 1.0912 1.0965 1.0660
irintensity: 0.2310 0.2179 0.0987 0.2143 0.3677 0.1850 2.3154 1.3720 2.9338 0.1115 0.0800 0.5934 0.7109 1.7784 0.8749 1.0830 0.5760 0.1744 133.1469 6.4271 0.4189 7.4597 1.7918 3.8812 2.3353 1.4732 1.6716 2.1283 5.7133 6.8961 6.9237 17.8450 39.9667 2.7958 39.6845 9.8060 0.4963 3.3505 14.1538 5.8059 15.7294 13.6507 31.7447 21.0682 6.8609 10.8507 1.9463 27.9164 5.7748 8.6220 6.9744 6.8854 8.5246 3.4798 18.7394 6.6522 6.9116 1.1694 11.3303 29.6549 6.6961 139.4812 10.2381 4.2695 6.9180 3.7447 3.2894 9.1814 4.3069 1.6718 4.4430 18.8901 15.3776 1.0648 7.6081 1.1702 1.0479 6.4826 1.1183 15.5275 15.0853 16.3605 4.9476 3.1962 4.5520 2.8462 17.9604 12.7131 22.6452 2.9185 16.8313 42.7162 0.9740 2.3458 18.5094 8.2672 66.1651 73.5699 85.3253 12.8694 39.2276 21.5883 37.0121 24.8147 50.5948 26.0793 21.9194 16.0529 80.5085 62.6091 18.2931 37.4862 62.5289 21.7994 51.0928 50.6209 41.8459 34.8229 11.0729 20.8189 9.7145 12.2481 33.4053
temp: 298.150 k
press: 1.00000 atm
elementType: 8 7 6 6 6 6 6 6 6 6 6 6 6 6 6 6 6 6 1 1 1 1 1 1 1 1 1 1 1 1 1 1 1 1 1 1 1 1 1 1 1 1 1
symmnumber: 1
zpe: 986703.0 jmol-1
zpe.correction: 0.375815 hartree
zpe.thermalcorrener: 0.394882 hartree
zpe.thermalcorrenthalpy: 0.395826 hartree
zpe.thermalcorrgfe: 0.328001 hartree
zpe.sumelectzpe: -753.245203 hartree
zpe.sumelectthermal: -753.226137 hartree
zpe.sumelectthermalent: -753.225193 hartree
zpe.sumelectthermalfe: -753.293018 hartree
dipole: 0.0281 1.9458 0.5247
dipole: 2.0155
quadrupole: -111.8133 -105.1151 -109.7019
quadrupole: 5.4975 0.7939 7.1364
quadrupole: -2.9365 3.7616 -0.8251 5.4975 0.7939 7.1364
hfenergy: -753.6210188 hartree
pointgroup: C01 [X(C16H25N1O1)]
dipole: -0.3518284 0.6452435 -0.2977939 debye
polarizability: 177.1162838|-17.9110412|187.1633661|2.4027837|-6.6625539|168.9695973 unknown
InChI: InChI=1S/C16H25NO/c1-4-13(2)11-16(8-9-17(3)12-16)14-6-5-7-15(18)10-14/h5-7,10,13,18H,4,8-9,11-12H2,1-3H3
charge 0 multiplicity 1
43 atoms
O  -2.982673 2.798632 0.954747
N  -0.258774 -3.358337 -0.049177
C  0.205238 -0.9382 0.388198
C  -0.477809 -1.627803 1.640849
C  0.544243 -2.19948 -0.522695
C  1.508909 -0.199584 0.875534
C  -0.271855 -3.158277 1.426891
C  2.307999 0.679618 -0.128109
C  -0.729733 0.104619 -0.262284
C  3.349395 1.517889 0.669646
C  -1.617288 -3.428996 -0.644491
C  2.987395 -0.132153 -1.25677
C  -1.467065 0.979233 0.576531
C  -0.830603 0.293045 -1.66813
C  4.101043 2.580031 -0.162388
C  -2.288972 1.988834 0.033321
C  -1.655907 1.304717 -2.207019
C  -2.396985 2.162796 -1.366746
H  -1.556742 -1.396281 1.664885
H  -0.0379 -1.279919 2.592748
H  0.374356 -2.045503 -1.599443
H  1.61242 -2.450934 -0.38411
H  2.188946 -0.96478 1.309201
H  1.206402 0.461678 1.713695
H  0.708471 -3.477383 1.831884
H  -1.054516 -3.77492 1.901057
H  1.597231 1.391944 -0.596835
H  2.82266 2.028513 1.501925
H  4.08228 0.829108 1.141219
H  -2.253491 -2.530128 -0.46413
H  -2.14154 -4.312287 -0.238106
H  -1.525219 -3.565168 -1.736604
H  3.691112 -0.878474 -0.838545
H  3.558562 0.528733 -1.933198
H  2.251108 -0.671001 -1.876711
H  -1.417943 0.893558 1.666641
H  -0.26657 -0.342595 -2.356634
H  3.389832 3.257368 -0.672457
H  4.751067 3.19893 0.48352
H  4.743853 2.12164 -0.935286
H  -1.722408 1.42782 -3.293907
H  -3.039105 2.945612 -1.790835
H  -3.533725 3.471782 0.483724
