program: Gaussian 09
title: 000217372
version: EM64L-G09RevD.01
frameworkgroup: C1[X(C12H17N)]
method: RPBEPBE
basis: SDD
operation: Freq
keyword: #pfreq=noraman
keyword: PBEPBE/SDD
title: #p freq=noraman PBEPBE/SDD
converged: YES YES NO NO
title: Mulliken charges:
elementType: N C C C C C C C C C C C C H H H H H H H H H H H H H H H H H
charge: -0.636548 -0.186270 -0.100754 -0.431267 -0.452975 -0.409205 -0.373111 0.469050 -0.437147 -0.401471 -0.233467 -0.252283 -0.245881 0.193009 0.207757 0.206956 0.201480 0.195263 0.197107 0.197377 0.187870 0.188613 0.215469 0.264336 0.290570 0.230733 0.243639 0.222245 0.222617 0.226287
chargesum: 0.00000
title: Mulliken charges with hydrogens summed into heavy atoms:
elementType: N C C C C C C C C C C C C
charge: -0.081642 0.006739 0.107003 -0.022831 -0.060604 -0.023958 0.030972 0.469050 -0.206413 -0.157833 -0.011222 -0.029667 -0.019594
polarizability: 1.70625383e+02 1.64847859e+00 1.09004192e+02 -3.38782433e+00 1.54892218e+01 1.07723418e+02
1716.lowfreq: -22.7846 -17.5195 -6.0406 -0.0002 0.0003 0.0007 32.3549 80.4143 93.9129
frequency: 31.8787 80.3889 93.5915 168.3029 208.9859 247.0915 262.2518 264.6991 308.4176 359.2593 376.9000 405.5838 460.9379 490.7896 528.2533 596.4178 617.2331 625.4992 684.8480 707.5840 750.9830 774.2449 810.8665 832.7538 855.0779 859.4899 888.0035 911.4892 923.6703 976.4512 980.4089 989.8393 993.2398 1004.2122 1012.1508 1029.1388 1060.4069 1077.2326 1089.1082 1104.0818 1130.8592 1171.0437 1189.2853 1189.7149 1201.9057 1223.7757 1237.6921 1250.1423 1289.3812 1301.4252 1321.4193 1330.0282 1337.6106 1340.9877 1350.2676 1364.5865 1371.4986 1383.1388 1437.9408 1449.1000 1458.2392 1461.9839 1474.1880 1482.7137 1588.0472 1611.0640 1631.1064 2854.3525 2957.0912 2957.4884 2964.0805 2986.1595 2986.4144 3015.7356 3025.5291 3046.0228 3054.0145 3110.2137 3122.2106 3135.5130 3150.3165 3162.5783 3442.1479 3567.6309
redmass: 3.4846 3.7198 3.4812 2.7851 2.6056 2.2980 1.3567 3.9082 2.0223 3.4373 2.0301 2.8287 2.1208 2.9583 3.1379 1.6147 5.4855 4.0250 1.8963 1.7713 2.2467 1.8948 2.7374 2.0413 1.2509 2.5965 1.8688 1.7486 1.5084 1.4046 2.3786 5.0740 1.3556 1.9533 1.9698 2.1070 1.7583 1.3520 1.8403 1.2341 1.9610 1.0549 1.1909 1.4824 1.9675 1.7348 1.3391 1.2594 1.3550 1.2868 1.3318 1.6574 1.3919 1.4342 1.3879 1.5058 1.6132 4.0894 2.1535 1.0880 1.0851 1.0896 1.0929 2.2595 5.8707 5.9477 1.1015 1.0821 1.0783 1.0638 1.0641 1.0629 1.0606 1.1008 1.0952 1.1028 1.1027 1.0867 1.0862 1.0924 1.0946 1.1003 1.0449 1.0971
irintensity: 0.3038 0.0566 0.3980 1.5943 2.6889 18.8086 59.8145 1.6523 1.0209 0.9975 0.4144 0.5550 3.7502 4.0241 12.0820 89.3624 5.1643 3.8787 59.4103 46.1923 20.8404 27.6288 3.0723 0.4348 0.2501 5.2196 5.2877 1.9707 0.5826 0.0760 5.9907 0.3503 0.1265 10.3819 1.8536 6.3866 6.9500 4.6782 0.2461 1.4484 8.1439 0.0810 0.5642 2.9942 3.4674 3.2307 4.5782 0.3816 3.1761 2.5530 3.3238 3.9358 1.7215 2.1065 3.1013 4.9648 5.0447 0.4687 7.9554 9.7691 11.0079 4.0853 10.8606 21.8721 2.3455 12.6367 61.8399 81.6646 7.0290 50.1610 66.8808 5.9346 79.8644 46.1707 65.4055 15.4637 79.9425 9.8291 0.0935 28.2956 39.6869 16.8280 2.5756 0.8842
temp: 298.150 k
press: 1.00000 atm
elementType: 7 6 6 6 6 6 6 6 6 6 6 6 6 1 1 1 1 1 1 1 1 1 1 1 1 1 1 1 1 1
symmnumber: 1
zpe: 691192.8 jmol-1
zpe.correction: 0.263261 hartree
zpe.thermalcorrener: 0.275100 hartree
zpe.thermalcorrenthalpy: 0.276044 hartree
zpe.thermalcorrgfe: 0.225258 hartree
zpe.sumelectzpe: -521.242529 hartree
zpe.sumelectthermal: -521.230690 hartree
zpe.sumelectthermalent: -521.229746 hartree
zpe.sumelectthermalfe: -521.280533 hartree
dipole: 0.0740 -1.1190 0.1153
dipole: 1.1274
quadrupole: -75.7935 -77.7060 -77.0244
quadrupole: -0.8052 -1.5332 1.6464
quadrupole: 1.0478 -0.8647 -0.1831 -0.8052 -1.5332 1.6464
hfenergy: -521.5057902 hartree
pointgroup: C01 [X(C12H17N1)]
dipole: -0.0418841 0.4412978 0.0154896 debye
polarizability: 170.1766651|4.1095675|107.1543337|5.6237128|-15.2229188|110.0219946 unknown
InChI: InChI=1S/C12H17N/c13-12-9-5-4-8-11(12)10-6-2-1-3-7-10/h1-3,6-7,11-12H,4-5,8-9,13H2
charge 0 multiplicity 1
30 atoms
N  -1.248552 0.958803 1.601212
C  -0.662875 -0.116748 -0.579049
C  -1.391849 1.079092 0.134269
C  -1.368547 -1.457585 -0.258167
C  -2.894261 1.093516 -0.248228
C  -2.858014 -1.416357 -0.672137
C  -3.593573 -0.255443 0.03712
C  0.835305 -0.100627 -0.273303
C  1.699627 0.723292 -1.043899
C  1.404304 -0.85263 0.789262
C  3.081975 0.799407 -0.765368
C  2.787865 -0.779932 1.072287
C  3.633428 0.047142 0.298482
H  -0.785072 0.076807 -1.666786
H  -0.929235 2.018407 -0.260033
H  -1.315857 -1.647997 0.83023
H  -0.843935 -2.286406 -0.772216
H  -2.973484 1.329763 -1.329177
H  -3.403882 1.916598 0.294186
H  -3.344608 -2.381078 -0.42976
H  -2.934962 -1.285387 -1.772711
H  -4.650051 -0.207911 -0.292106
H  -3.592094 -0.440303 1.128114
H  -1.82072 1.629164 2.125087
H  -0.272824 0.957622 1.918078
H  1.281979 1.304319 -1.876506
H  0.765781 -1.5067 1.392123
H  3.728796 1.437863 -1.378378
H  3.205598 -1.372083 1.895009
H  4.706241 0.100089 0.515865
