program: Gaussian 09
title: 000217367
version: EM64L-G09RevD.01
frameworkgroup: C1[X(C13H15NO2)]
method: RPBEPBE
basis: SDD
operation: Freq
keyword: #p
keyword: freq=noraman
keyword: PBEPBE/SDD
title: #p freq=noraman PBEPBE/SDD
converged: YES YES NO NO
title: Mulliken charges:
elementType: O O N C C C C C C C C C C C C C H H H H H H H H H H H H H H H
charge: -0.279426 -0.252560 -0.078921 -0.416753 -0.621884 -0.613645 0.222719 -0.339650 -0.333782 0.207720 -0.219536 -0.217603 -0.221877 -0.000070 -0.380926 0.031771 0.241569 0.217888 0.223913 0.250573 0.185665 0.229039 0.187098 0.226148 0.270202 0.272482 0.233812 0.231590 0.232624 0.247296 0.264525
chargesum: 0.00000
title: Mulliken charges with hydrogens summed into heavy atoms:
elementType: O O N C C C C C C C C C C C C C
charge: -0.279426 -0.252560 -0.078921 0.042705 0.038266 0.028640 0.222719 -0.069448 -0.061299 0.207720 0.014276 0.013987 0.010746 -0.000070 0.130894 0.031771
polarizability: 2.08821674e+02 -1.42103285e+01 1.41464092e+02 8.68505140e+00 1.29404134e+01 1.15700317e+02
1716.lowfreq: -17.5074 -8.5648 -0.7383 -0.0010 -0.0009 -0.0008 1.8846 17.9415 22.4813
frequency: -13.5200 11.7352 22.2437 55.2555 67.8146 75.8959 135.6885 156.3790 191.7499 231.4156 236.7049 254.0311 271.7419 312.1110 316.3718 345.9328 361.3660 382.1897 404.2576 432.3855 445.0130 489.5876 566.8325 614.8304 655.6272 679.3466 701.6015 759.3840 788.1905 796.0626 811.7511 865.7175 874.7844 955.8338 962.1728 990.1084 994.2907 997.4263 1009.1554 1015.8839 1019.1191 1035.0910 1042.7913 1085.3736 1090.7505 1131.9427 1171.1944 1174.0184 1175.4735 1181.5596 1237.1837 1240.0762 1252.1433 1265.7958 1314.9418 1344.8214 1352.7924 1390.4127 1417.5161 1438.0905 1438.5610 1439.5559 1449.2119 1459.1587 1471.0478 1475.6293 1478.6762 1484.5674 1586.2021 1611.8513 1627.2088 2284.5161 2810.8571 2844.8473 2861.4219 3003.1317 3014.5289 3020.8572 3032.2635 3081.0438 3084.9014 3092.2375 3130.4278 3143.4209 3155.8185 3167.7940 3180.2687
redmass: 2.9614 4.4046 4.2787 5.4859 3.8368 4.2564 4.8850 4.2032 4.8555 1.3241 1.1296 2.6433 2.7783 2.7967 2.9727 4.3931 3.7658 2.5688 2.8266 4.7932 4.3812 4.4267 7.4746 6.4337 6.1999 5.1385 1.6035 5.6245 4.7691 2.1878 4.2316 1.2443 8.2825 1.4213 1.7139 5.6918 2.2279 1.3859 1.3283 2.9475 2.6274 1.5179 2.4835 1.6238 1.2547 1.3831 1.8073 1.0677 3.2436 1.1571 2.4118 1.2705 2.2842 1.6297 1.3180 1.3331 1.4822 10.1145 1.1400 1.3016 1.6333 1.1943 1.0907 1.0463 1.0599 1.0538 2.2947 1.0524 6.6476 6.1163 10.1595 11.7640 1.0703 1.0575 1.0569 1.0841 1.0582 1.0718 1.0725 1.1009 1.1038 1.1011 1.0855 1.0892 1.0940 1.0981 1.0974
irintensity: 0.5185 0.4888 0.6342 2.0566 1.2030 0.9670 0.8181 1.2392 1.2946 1.2402 0.4884 2.3723 6.0667 7.3584 32.4905 2.2682 1.5352 0.4436 0.0143 1.1581 0.5044 6.3773 10.2433 0.8460 2.1532 14.3894 92.7500 6.1832 4.3954 26.0623 24.8086 0.0558 100.4132 4.4686 1.9330 6.0731 20.8515 0.1054 0.5186 182.5544 39.1988 16.8669 178.6141 16.7600 9.1354 7.0594 9.6894 1.4527 52.0332 33.1491 270.7856 40.1408 12.6992 6.0664 1.9031 35.2288 39.8820 2.9816 3.0601 23.0674 6.1758 21.4072 7.4980 16.2508 14.4244 19.6190 4.6937 14.3208 28.5660 12.3374 167.4742 10.8630 64.9254 86.3482 191.7590 18.8666 24.9459 45.4862 37.5662 27.7311 4.7844 34.1879 0.3506 11.5775 16.2254 21.2577 7.6929
temp: 298.150 k
press: 1.00000 atm
elementType: 8 8 7 6 6 6 6 6 6 6 6 6 6 6 6 6 1 1 1 1 1 1 1 1 1 1 1 1 1 1 1
symmnumber: 1
zpe: 652144.0 jmol-1
zpe.correction: 0.248389 hartree
zpe.thermalcorrener: 0.264020 hartree
zpe.thermalcorrenthalpy: 0.264964 hartree
zpe.thermalcorrgfe: 0.202550 hartree
zpe.sumelectzpe: -708.320284 hartree
zpe.sumelectthermal: -708.304653 hartree
zpe.sumelectthermalent: -708.303708 hartree
zpe.sumelectthermalfe: -708.366123 hartree
dipole: 0.1885 2.3911 -0.0520
dipole: 2.3990
quadrupole: -76.7017 -92.5378 -92.4217
quadrupole: -4.1514 -3.6092 -1.2276
quadrupole: 10.5187 -5.3174 -5.2013 -4.1514 -3.6092 -1.2276
hfenergy: -708.5686725 hartree
pointgroup: C01 [X(C13H15N1O2)]
dipole: -0.0791842 0.925795 0.1658238 debye
polarizability: 208.0272806|12.8995492|144.8380541|13.9288937|-7.8816231|113.1207483 unknown
InChI: InChI=1S/C13H15NO2/c1-14(2)10-6-7-11-16-13(15)12-8-4-3-5-9-12/h3-5,8-9H,10-11H2,1-2H3
charge 0 multiplicity 1
31 atoms
O  0.549702 -0.53727 -1.209906
O  1.327782 -2.176563 0.266666
N  -4.920077 0.664002 -0.114068
C  -4.06177 -0.344081 0.561215
C  -4.228529 1.952369 -0.322999
C  -6.207399 0.820362 0.591655
C  2.546502 -0.073012 0.034235
C  3.560515 -0.470129 0.944743
C  2.596627 1.21146 -0.567605
C  1.449258 -1.041188 -0.25453
C  4.618151 0.410565 1.249729
C  3.657191 2.088991 -0.258387
C  4.66855 1.69133 0.648509
C  -2.852291 -0.698232 -0.201693
C  -0.622526 -1.417942 -1.53645
C  -1.821148 -1.021166 -0.796745
H  -4.667704 -1.259147 0.712463
H  -3.740353 -0.004034 1.582986
H  -4.881781 2.628653 -0.90188
H  -3.304421 1.784326 -0.901453
H  -3.953286 2.464916 0.634429
H  -6.850117 1.520361 0.029682
H  -6.101861 1.214014 1.635806
H  -6.728292 -0.152862 0.642983
H  3.498491 -1.465175 1.397621
H  1.807751 1.505289 -1.265242
H  5.400277 0.102968 1.952067
H  3.696882 3.080701 -0.721842
H  5.490912 2.375679 0.885771
H  -0.759827 -1.287602 -2.622651
H  -0.343908 -2.463284 -1.308308
