program: Gaussian 09
title: 000217365
version: EM64L-G09RevD.01
frameworkgroup: C1[X(C17H15NO2)]
method: RPBEPBE
basis: SDD
operation: Freq
keyword: #p
keyword: freq=noraman
keyword: PBEPBE/SDD
title: #p freq=noraman PBEPBE/SDD
converged: YES YES NO NO
title: Mulliken charges:
elementType: O O N C C C C C C C C C C C C C C C C C H H H H H H H H H H H H H H H
charge: -0.283105 -0.456251 -0.193017 0.262508 0.155510 -0.541585 0.188608 -0.335141 0.457674 -0.356932 -0.384320 0.043322 -0.227880 -0.240290 -0.437945 -0.344326 -0.355761 -0.216861 -0.232400 -0.235144 0.232550 0.248703 0.286993 0.232042 0.288457 0.225748 0.228138 0.237122 0.252238 0.217676 0.215562 0.233423 0.234625 0.235794 0.364264
chargesum: 0.00000
title: Mulliken charges with hydrogens summed into heavy atoms:
elementType: O O N C C C C C C C C C C C C C C C C C
charge: -0.283105 -0.091988 -0.193017 0.262508 0.155510 -0.060332 0.188608 -0.048148 0.457674 -0.124890 -0.095863 0.043322 -0.002132 -0.012152 -0.200822 -0.092088 0.077476 0.016562 0.002225 0.000650
polarizability: 2.47031442e+02 -2.37357211e+01 2.18377918e+02 1.95262966e+01 1.59192447e+00 1.28594211e+02
1716.lowfreq: -6.8921 -4.0096 0.0003 0.0004 0.0008 4.4823 10.6881 22.8364 40.8102
frequency: 10.1192 22.7651 40.8001 57.0746 75.3527 103.3092 130.6175 142.0515 169.9765 223.2126 230.6032 268.6483 302.9702 313.0085 340.2709 402.4009 409.0180 427.7321 461.0517 471.9669 524.5596 546.4154 570.6084 576.9875 579.6386 617.5662 627.9685 643.7356 703.7270 725.4968 755.3839 757.3732 766.4369 769.1696 796.9585 818.4540 839.9320 857.0406 864.7188 898.6807 917.2794 948.5623 974.5768 981.3090 990.9753 991.6374 999.4780 1002.1550 1014.0762 1019.8719 1027.3161 1056.8900 1088.4686 1113.4615 1154.1200 1170.4772 1175.4639 1182.2472 1188.9122 1194.1852 1214.1666 1219.6102 1249.7008 1261.9693 1299.1262 1331.3682 1335.9094 1373.6713 1383.0086 1390.9497 1396.6375 1412.1119 1442.7124 1454.5055 1460.1457 1473.3966 1481.9134 1488.2545 1520.3243 1575.7207 1586.2014 1596.6647 1615.7399 1624.7024 2954.0419 2989.0690 2993.8122 3046.1788 3120.2670 3125.5756 3130.0749 3138.5875 3142.8791 3151.2777 3160.7132 3167.8985 3182.5506 3223.1501 3362.4252
redmass: 4.4867 3.8661 5.5344 4.8598 3.3759 5.6263 4.7915 4.0820 4.9421 4.3651 4.1897 6.5781 2.9842 4.5169 4.4326 2.8048 7.2810 2.9232 3.3662 1.3396 5.7897 2.0988 4.4432 4.2149 5.9454 6.2616 5.2016 3.2430 2.1334 2.8716 2.2022 1.3182 4.7769 4.5576 4.3670 3.3531 1.4518 1.2492 1.4167 6.6755 1.3804 1.3671 1.8618 1.3987 5.8576 1.3234 2.0536 1.3352 2.2205 4.9061 2.3794 4.0964 1.6115 2.0243 1.6452 1.2047 1.0552 1.0754 1.1513 1.3767 1.8879 1.9700 1.3858 1.7293 1.7983 2.5095 1.4124 1.9284 5.0681 2.4661 2.2348 3.9420 2.1810 2.6439 1.1421 1.5639 2.5488 1.9660 4.3201 6.4464 7.2679 6.0964 6.0588 7.5334 1.0565 1.0617 1.1040 1.1000 1.0882 1.0872 1.0857 1.0909 1.0911 1.0959 1.0973 1.1015 1.0969 1.0978 1.0637
irintensity: 0.4640 0.0268 1.0523 1.1440 5.8158 1.4682 2.6551 4.1768 0.1298 2.5276 2.9426 7.4090 2.3365 0.7981 38.5239 0.5225 3.8075 11.5830 3.7809 74.9350 3.0285 43.9533 13.3344 8.9152 1.8981 0.5492 3.5985 2.8930 33.7590 43.7727 28.3695 106.8695 2.2828 0.2278 8.9154 15.8129 9.8504 0.0642 2.3224 128.5016 4.5106 2.9899 2.5964 0.0163 0.9300 0.9976 0.4546 0.8183 28.7560 116.5998 21.7998 6.6844 11.2778 3.2537 6.7177 7.3843 0.3613 4.7916 22.4133 75.3698 0.7394 16.5086 118.7562 10.3189 45.0728 14.5213 34.4345 207.0534 4.2951 11.5486 87.5342 8.9673 23.2915 50.2328 13.9432 10.3186 4.3630 16.2280 35.7757 248.9639 14.6241 1.0094 2.8281 9.0850 48.3218 35.4590 30.7129 7.0021 7.3140 4.2884 1.1343 8.5641 22.7150 30.5706 23.3859 19.8161 7.4442 1.1079 46.5625
temp: 298.150 k
press: 1.00000 atm
elementType: 8 8 7 6 6 6 6 6 6 6 6 6 6 6 6 6 6 6 6 6 1 1 1 1 1 1 1 1 1 1 1 1 1 1 1
symmnumber: 1
zpe: 724412.3 jmol-1
zpe.correction: 0.275914 hartree
zpe.thermalcorrener: 0.292902 hartree
zpe.thermalcorrenthalpy: 0.293846 hartree
zpe.thermalcorrgfe: 0.227958 hartree
zpe.sumelectzpe: -860.610036 hartree
zpe.sumelectthermal: -860.593049 hartree
zpe.sumelectthermalent: -860.592104 hartree
zpe.sumelectthermalfe: -860.657992 hartree
dipole: -6.0809 -4.5951 -0.8567
dipole: 7.6698
quadrupole: -114.3602 -129.1365 -112.5122
quadrupole: -15.4701 2.4233 1.0968
quadrupole: 4.3094 -10.4668 6.1574 -15.4701 2.4233 1.0968
hfenergy: -860.8859503 hartree
pointgroup: C01 [X(C17H15N1O2)]
dipole: -2.8175492 -0.7370291 -0.7897854 debye
polarizability: 225.3005369|-33.054746|232.9305983|19.0673149|19.7585682|135.7724358 unknown
InChI: InChI=1S/C17H15NO2/c19-12-17(20)15-11-18(10-13-6-2-1-3-7-13)16-9-5-4-8-14(15)16/h1-9,11,19H,10,12H2
charge 0 multiplicity 1
35 atoms
O  3.93241 0.594382 0.728743
O  3.744218 3.208387 1.061602
N  -0.38037 -0.494094 -0.734504
C  0.423006 -1.658411 -0.667325
C  1.724739 -1.260326 -0.212169
C  -1.775817 -0.445794 -1.224073
C  1.683751 0.185143 -0.015634
C  0.379757 0.599486 -0.352192
C  -2.660066 0.516563 -0.439361
C  0.104402 -3.000587 -0.966522
C  2.734713 -2.239959 -0.043321
C  2.768354 1.039567 0.442136
C  1.124779 -3.95863 -0.791366
C  2.421552 -3.582974 -0.33523
C  -3.418653 1.499791 -1.118282
C  -2.764192 0.415083 0.971951
C  2.537522 2.558592 0.599364
C  -4.276054 2.367056 -0.401577
C  -3.616106 1.281672 1.688935
C  -4.376638 2.25953 1.003504
H  -2.176434 -1.472925 -1.146104
H  -1.780494 -0.17299 -2.2972
H  -0.059581 1.595218 -0.331095
H  -0.885009 -3.302806 -1.325488
H  3.726691 -1.94077 0.304545
H  0.915911 -5.010951 -1.013209
H  3.18782 -4.356221 -0.213063
H  -3.340614 1.58962 -2.208978
H  -2.173638 -0.338872 1.50642
H  1.714684 2.729704 1.324338
H  2.23008 2.984679 -0.378404
H  -4.858254 3.124431 -0.93766
H  -3.689345 1.19554 2.778553
H  -5.038161 2.931654 1.56089
H  4.42373 2.476211 1.156679
