program: Gaussian 09
title: 000217345
version: EM64L-G09RevD.01
frameworkgroup: C1[X(C21H20F3NO)]
method: RPBEPBE
basis: SDD
operation: Freq
keyword: #p
keyword: freq=noraman
keyword: PBEPBE/SDD
title: #p freq=noraman PBEPBE/SDD
converged: YES YES NO NO
title: Mulliken charges:
elementType: F F F O N C C C C C C C C C C C C C C C C C C C C C H H H H H H H H H H H H H H H H H H H H
charge: -0.167338 -0.165385 -0.167909 -0.445718 -0.267074 -0.095224 -0.406081 -0.312515 -0.421565 -0.371614 -0.458996 0.344154 0.270369 -0.747409 0.227483 0.456396 0.209077 -0.409378 -0.629574 -0.392669 -0.346051 0.318256 -0.275143 -0.262846 -0.359775 0.232765 0.236463 0.247255 0.178986 0.202237 0.200739 0.216732 0.192148 0.197743 0.232028 0.221865 0.208683 0.282283 0.347667 0.218932 0.279622 0.226901 0.229761 0.230694 0.260448 0.232577
chargesum: 0.00000
title: Mulliken charges with hydrogens summed into heavy atoms:
elementType: F F F O N C C C C C C C C C C C C C C C C C C C C C
charge: -0.167338 -0.165385 -0.167909 -0.098051 -0.035046 0.141239 0.020159 -0.110278 -0.004094 0.018278 -0.028448 0.344154 0.270369 -0.465126 0.227483 0.456396 0.209077 -0.190447 -0.349951 -0.165768 -0.116290 0.318256 -0.044449 -0.030269 -0.099327 0.232765
polarizability: 3.32897085e+02 2.59159326e+01 2.71457062e+02 1.92254888e+01 -2.10531723e+01 1.54221388e+02
1716.lowfreq: -15.2052 -12.6620 -2.2618 -0.0006 -0.0005 0.0008 4.7748 19.3278 32.1008
frequency: -15.0237 18.1692 32.0245 43.1838 52.6237 94.0915 100.9175 110.4928 118.7992 159.2675 170.8246 202.1901 221.9559 235.8077 237.2944 250.8558 283.9922 297.4325 311.8973 326.8465 355.0556 371.1080 392.1971 417.1911 430.0942 434.1655 455.5870 462.1622 464.6175 483.5231 489.0386 506.1541 534.9113 539.7975 558.4734 607.5920 610.8107 633.5128 655.7621 658.3157 677.5137 704.7942 731.7599 742.1908 778.5525 797.3561 799.0078 807.0673 835.3218 841.7415 855.9060 893.6960 896.5571 898.7846 907.9995 926.6833 941.8008 956.4377 958.5585 965.6427 967.5791 983.0273 990.7613 992.6101 1024.2057 1027.4762 1044.1151 1050.7825 1060.7666 1068.6874 1074.3438 1104.3545 1112.6962 1130.0733 1139.5853 1166.4623 1183.4927 1195.1759 1206.0244 1211.6898 1234.2424 1248.2201 1255.7140 1272.3585 1278.1043 1281.1246 1295.0181 1315.6773 1318.6560 1325.2454 1329.6630 1335.0619 1337.3742 1348.1808 1361.9930 1383.4446 1395.8601 1410.5699 1426.9013 1439.1353 1449.5920 1455.6253 1458.8518 1459.6308 1462.8150 1469.9608 1497.3819 1537.4379 1579.4964 1611.5968 1622.8052 1633.8208 2949.0447 2954.2042 2963.1982 2967.4716 2979.1161 2982.1420 3026.7375 3035.6002 3051.5671 3060.1858 3130.7000 3131.4653 3142.9437 3150.0947 3155.2576 3157.9603 3168.5050 3174.2985 3391.0952 3562.3373
redmass: 16.8467 5.2356 3.9734 3.5573 6.4584 4.2011 5.8700 3.7620 4.5415 6.7849 7.0307 3.7591 4.3660 3.4582 3.7351 4.6569 4.1019 2.0223 2.8260 1.5196 6.2809 7.3984 3.9949 2.1064 3.6070 3.4322 5.6263 6.1875 3.9299 3.5560 4.7232 4.9082 4.4604 3.3633 2.5784 6.6299 6.8758 3.8839 3.6454 5.7581 1.7583 5.7816 6.9372 2.5405 1.7132 2.0822 2.8586 1.8898 2.2765 1.6206 1.7706 1.9300 1.9542 2.9584 1.9980 2.3362 1.8744 1.4517 1.9327 1.4854 3.4962 6.4504 7.4041 1.3486 7.3123 4.2827 2.6938 2.3749 2.0585 2.1621 1.7995 3.1302 1.5991 2.3364 1.5968 1.3455 1.0948 1.4154 1.6290 1.3856 2.4805 1.2299 1.4091 1.3755 1.5650 3.9121 1.3394 1.3550 1.7825 1.4225 1.4127 1.3880 1.2928 1.3609 1.5580 3.7935 3.4549 3.9707 3.7680 1.1562 3.1955 1.0941 1.1302 3.3512 1.0890 1.0949 3.2190 3.8256 7.7590 6.2385 6.5532 6.6212 1.0819 1.0684 1.0616 1.0640 1.0644 1.0814 1.0964 1.1003 1.1032 1.0956 1.0851 1.0909 1.0885 1.0887 1.0921 1.0935 1.0999 1.0958 1.0732 1.0661
irintensity: 0.0977 0.1030 0.2773 0.3952 0.1471 0.0069 1.4116 1.0071 0.6690 0.1996 1.6047 1.8705 3.3770 4.4956 4.6331 11.7047 8.7194 4.5539 24.7871 133.5367 1.2623 1.2980 0.5376 9.6919 5.8683 3.3594 2.6417 13.3888 8.5776 6.1869 1.9060 14.8150 3.4448 0.1790 4.4382 4.7286 3.9352 1.1071 4.0678 6.6602 143.4190 1.2170 10.7149 33.5870 51.7423 19.0324 3.5044 1.2561 15.6631 28.8013 22.7222 2.8928 15.4605 41.0740 23.5810 8.1765 44.0962 1.6397 84.8606 5.1924 47.4589 153.9527 5.3681 0.1970 204.8722 47.7192 62.6289 38.2950 2.7168 15.3684 9.5249 12.1749 0.3829 4.8826 21.7227 7.4675 4.1382 27.1460 9.7931 98.2094 77.7085 10.9851 13.6631 30.4809 10.7958 186.2333 11.4713 15.2745 80.5773 6.6161 3.3675 1.1397 4.0656 2.2752 5.2817 10.6565 2.8645 23.0010 19.4558 24.4361 5.0697 2.2285 5.9996 8.8437 14.0547 8.0342 7.2820 15.9295 2.6391 17.2805 1.0191 9.5748 21.4591 18.6872 44.2426 31.0881 20.4947 50.8506 80.1477 63.0813 43.1351 31.2501 0.0488 2.1569 9.1539 4.0791 0.6468 29.8485 21.2962 23.1060 2.6958 8.1797
temp: 298.150 k
press: 1.00000 atm
elementType: 9 9 9 8 7 6 6 6 6 6 6 6 6 6 6 6 6 6 6 6 6 6 6 6 6 6 1 1 1 1 1 1 1 1 1 1 1 1 1 1 1 1 1 1 1 1
symmnumber: 1
zpe: 950705.2 jmol-1
zpe.correction: 0.362104 hartree
zpe.thermalcorrener: 0.383567 hartree
zpe.thermalcorrenthalpy: 0.384511 hartree
zpe.thermalcorrgfe: 0.310980 hartree
zpe.sumelectzpe: -1239.887582 hartree
zpe.sumelectthermal: -1239.866119 hartree
zpe.sumelectthermalent: -1239.865175 hartree
zpe.sumelectthermalfe: -1239.938706 hartree
dipole: 4.9920 3.5006 0.2296
dipole: 6.1014
quadrupole: -159.6055 -141.5256 -152.7354
quadrupole: -8.3395 -0.6179 -0.9824
quadrupole: -8.3167 9.7632 -1.4466 -8.3395 -0.6179 -0.9824
hfenergy: -1240.2496861 hartree
pointgroup: C01 [X(C21H20F3N1O1)]
dipole: -1.9817301 -1.3466651 -0.1465013 debye
polarizability: 334.6892883|25.5960932|264.0238773|-9.0037365|35.4165578|159.8623699 unknown
InChI: InChI=1S/C21H20F3NO/c22-21(23,24)14-8-9-15-13(11-14)12-18(17-6-2-1-5-16(15)17)20(26)19-7-3-4-10-25-19/h1-2,5-6,8-9,11-12,19-20,25-26H,3-4,7,10H2
charge 0 multiplicity 1
46 atoms
F  5.49454 1.739032 -1.06279
F  4.583532 2.75835 0.750082
F  5.922053 0.94362 1.009522
O  -2.240858 1.10886 2.543448
N  -3.256393 0.635923 -1.01667
C  -3.062675 1.311614 0.295086
C  -4.364543 1.964851 0.830283
C  -2.435019 0.319865 1.307401
C  -4.936576 2.944055 -0.225786
C  -5.129329 2.250972 -1.597546
C  -3.813262 1.558452 -2.043225
C  -1.106638 -0.258635 0.814394
C  -0.985236 -1.598038 0.248435
C  0.018007 0.545511 0.911311
C  0.302663 -2.065714 -0.218403
C  1.312693 0.119309 0.449624
C  1.472193 -1.191566 -0.125198
C  -2.109145 -2.478599 0.142166
C  2.436113 0.992856 0.553717
C  0.394729 -3.381809 -0.768611
C  2.774426 -1.571321 -0.578775
C  3.694205 0.588206 0.098578
C  -1.987058 -3.764038 -0.396363
C  -0.721876 -4.220229 -0.859063
C  3.867116 -0.707443 -0.47382
C  4.884266 1.492555 0.200679
H  -2.313074 2.114161 0.132422
H  -4.158597 2.486222 1.781671
H  -5.108768 1.167705 1.044922
H  -3.166375 -0.489164 1.518001
H  -4.234658 3.795528 -0.345356
H  -5.894193 3.369847 0.129464
H  -5.933841 1.490156 -1.519385
H  -5.449219 2.986111 -2.362291
H  -3.86318 -0.193531 -0.914761
H  -3.962881 0.987553 -2.978017
H  -3.043868 2.328893 -2.250086
H  -0.082708 1.547232 1.345124
H  -1.716201 0.563761 3.183196
H  -3.091711 -2.148424 0.491123
H  2.301973 1.987441 0.990914
H  1.357621 -3.754749 -1.129277
H  2.936774 -2.556558 -1.023512
H  -2.863131 -4.418166 -0.462748
H  4.8541 -1.018748 -0.829855
H  -0.621697 -5.224812 -1.283522
