program: Gaussian 09
title: 000217335
version: EM64L-G09RevD.01
frameworkgroup: C1[X(C16H26N2)]
method: RPBEPBE
basis: SDD
operation: Freq
keyword: #pfreq=noraman
keyword: PBEPBE/SDD
title: #p freq=noraman PBEPBE/SDD
converged: YES YES NO NO
title: Mulliken charges:
elementType: N N C C C C C C C C C C C C C C C C H H H H H H H H H H H H H H H H H H H H H H H H H H
charge: -0.166058 -0.082916 -0.401575 -0.383114 -0.393367 -0.380281 -0.401631 0.460189 -0.243480 0.570454 -0.381656 -0.385570 -0.415207 -0.502998 -0.416263 -0.721699 -0.616382 -0.626457 0.191001 0.223471 0.214987 0.197383 0.196591 0.205526 0.205296 0.195064 0.219037 0.190867 0.209890 0.201923 0.213865 0.230937 0.215804 0.225236 0.222268 0.244051 0.215973 0.201337 0.226037 0.186276 0.218693 0.218417 0.187431 0.230648
chargesum: 0.00000
title: Mulliken charges with hydrogens summed into heavy atoms:
elementType: N N C C C C C C C C C C C C C C C C
charge: -0.166058 -0.082916 0.012897 0.029256 0.008750 0.020080 0.008273 0.460189 -0.033591 0.570454 0.034133 -0.154632 -0.199403 -0.277761 -0.193995 -0.060337 0.014624 0.010039
polarizability: 2.79948433e+02 -1.71518366e+00 1.67416314e+02 -7.11045164e+00 -7.68657429e+00 1.36786523e+02
1716.lowfreq: -25.6620 -13.0082 -8.2405 -0.0007 -0.0005 -0.0003 8.3117 21.4894 29.9101
frequency: 4.3123 19.5598 29.7188 60.1245 68.7323 85.1544 103.0528 167.5273 186.3892 190.5321 194.5960 214.4510 224.3288 238.3410 249.4795 279.5131 317.7721 343.6693 359.9129 369.8334 410.3491 413.9143 429.4723 438.5753 444.3445 485.8366 504.8742 549.1976 587.2115 637.5714 686.5194 735.2975 774.4904 802.6962 808.0191 811.9733 830.1864 839.5799 850.1266 883.9883 910.0766 913.9576 919.8845 935.4416 950.7437 951.8194 996.3158 1016.3526 1021.3628 1028.7277 1036.3550 1061.5718 1082.5298 1085.1959 1089.0978 1111.6548 1124.5239 1127.0159 1128.9746 1141.3614 1152.6031 1186.6802 1197.7320 1222.1654 1229.0048 1236.8681 1257.0989 1263.9052 1270.9041 1276.1619 1282.4669 1318.5795 1327.9232 1331.9619 1342.7813 1347.9469 1349.5047 1355.7673 1357.0791 1373.2617 1379.4567 1383.3122 1415.9736 1423.5899 1437.7408 1452.5344 1457.5629 1460.6647 1460.7658 1464.0687 1465.5446 1468.0430 1472.8482 1475.1425 1477.6913 1482.5134 1485.1292 1511.6403 1566.7392 1627.0325 2836.5320 2840.1278 2859.1063 2869.4747 2877.5590 2967.8745 2973.7467 2978.7551 2984.7742 2986.2816 3010.8056 3014.3884 3023.8467 3036.2899 3043.9977 3049.4187 3055.2087 3070.9126 3073.7226 3079.9901 3084.0293 3088.8318 3107.7229 3112.4227 3146.7868 3157.1582
redmass: 2.9318 4.0485 2.8693 3.0947 3.5531 2.5689 3.3925 2.4595 2.6290 1.3382 2.7534 1.4056 1.5230 1.1791 2.3451 2.8930 2.9595 3.3375 1.7816 1.9367 2.9310 3.5158 2.9562 2.8238 2.9479 2.1212 2.5235 2.3342 2.7716 6.7837 3.2023 3.6249 3.7817 1.5399 1.5295 1.8166 2.6290 2.8206 1.4132 2.2561 1.4545 2.1868 3.1764 1.4394 1.3707 1.3157 2.9527 1.8833 2.0717 2.0342 1.6261 1.9289 1.6188 1.3755 1.4434 2.2407 1.5972 2.1995 2.2533 1.5808 1.2738 1.8263 1.1966 2.1185 2.0737 1.5140 2.3769 1.2641 1.1884 1.3962 1.8960 1.3016 1.5145 1.2781 1.3849 1.6381 1.7079 1.5635 1.3953 1.6483 1.2166 2.4185 1.1768 3.0731 1.1563 1.0936 1.0785 1.0565 1.0800 1.0614 1.0931 1.0862 1.0679 1.0593 1.0959 1.0533 1.0525 2.6768 6.3639 6.4326 1.0679 1.0574 1.0590 1.0708 1.0721 1.0633 1.0822 1.0354 1.0611 1.0608 1.0890 1.0720 1.0714 1.0962 1.0994 1.0938 1.1020 1.0988 1.1007 1.1005 1.0882 1.1001 1.0890 1.0875 1.0934 1.0931
irintensity: 0.4685 0.8397 0.1633 0.7970 0.6306 0.5145 0.2788 1.5071 2.4130 0.3627 0.3435 0.3705 0.9703 0.1469 6.8449 1.1789 5.3310 0.1163 2.5853 5.3584 1.6464 3.4356 2.3837 2.8443 0.6313 1.3065 1.0534 33.1000 6.9069 0.1907 1.7767 2.9996 2.9324 3.9204 7.2260 6.6644 53.6782 1.7899 22.5503 2.5936 0.1257 7.1346 43.8034 0.6847 2.1124 3.1348 10.5532 3.6106 26.1572 60.4002 32.4064 2.9265 5.7379 1.7678 11.6044 4.2445 2.1865 35.1964 16.5521 2.5742 8.3758 15.0350 14.9462 24.3686 21.4375 167.6044 9.2462 2.7714 14.3416 0.3439 1.2142 0.5709 2.0128 1.8436 0.5327 10.0574 27.4214 2.9662 1.3961 43.0965 20.7860 17.1090 3.2174 4.2003 0.7847 7.5637 4.3611 11.5150 21.7733 12.0704 37.5505 4.7589 13.7807 23.7269 10.0845 7.5811 16.7155 194.9647 5.2556 102.0322 60.2369 70.9854 236.5536 55.8543 136.2041 41.5088 11.9567 29.2556 36.5362 37.3413 33.4849 52.1560 46.2824 80.3950 45.4504 1.7390 96.6480 23.9171 48.8802 57.6102 21.6100 29.2031 21.7932 28.6875 27.3721 14.4489
temp: 298.150 k
press: 1.00000 atm
elementType: 7 7 6 6 6 6 6 6 6 6 6 6 6 6 6 6 6 6 1 1 1 1 1 1 1 1 1 1 1 1 1 1 1 1 1 1 1 1 1 1 1 1 1 1
symmnumber: 1
zpe: 1020667.9 jmol-1
zpe.correction: 0.388752 hartree
zpe.thermalcorrener: 0.407904 hartree
zpe.thermalcorrenthalpy: 0.408848 hartree
zpe.thermalcorrgfe: 0.338042 hartree
zpe.sumelectzpe: -733.374800 hartree
zpe.sumelectthermal: -733.355649 hartree
zpe.sumelectthermalent: -733.354704 hartree
zpe.sumelectthermalfe: -733.425510 hartree
dipole: -1.9088 0.5938 0.6058
dipole: 2.0888
quadrupole: -98.1093 -105.9869 -114.1158
quadrupole: 3.1820 3.7606 -3.2440
quadrupole: 7.9614 0.0838 -8.0451 3.1820 3.7606 -3.2440
hfenergy: -733.7635521 hartree
pointgroup: C01 [X(C16H26N2)]
dipole: -0.7526218 -0.2640217 -0.1979536 debye
polarizability: 279.9505822|1.964091|163.9838273|7.0045336|-12.3578613|140.2168608 unknown
InChI: InChI=1S/C16H26N2/c1-14(13-17(2)3)15-7-9-16(10-8-15)18-11-5-4-6-12-18/h7-10,14H,4-6,11-13H2,1-3H3
charge 0 multiplicity 1
44 atoms
N  -2.88649 -0.019892 -0.046404
N  5.076423 -0.12404 -0.511789
C  -3.638583 -1.256103 0.248337
C  -3.692571 1.216978 0.105117
C  -4.93196 -1.3418 -0.592872
C  -4.968581 1.176896 -0.7600
C  -5.805156 -0.078662 -0.428282
C  -1.489719 0.019155 0.209047
C  2.897877 0.085186 0.800877
C  1.379414 0.076773 0.615081
C  3.59667 -0.059502 -0.584772
C  -0.810292 -1.043276 0.876483
C  -0.692198 1.11726 -0.240337
C  0.589457 -1.009504 1.058758
C  0.698952 1.1406 -0.036194
C  3.410022 1.336886 1.553776
C  5.704985 0.122536 -1.824964
C  5.573974 -1.369311 0.105923
H  -3.897997 -1.320506 1.334488
H  -3.001143 -2.124052 0.007398
H  -3.079836 2.090699 -0.16427
H  -3.987701 1.344901 1.175924
H  -5.492991 -2.248636 -0.295109
H  -4.653528 -1.45672 -1.658622
H  -4.681744 1.161033 -1.829442
H  -5.556264 2.098022 -0.581743
H  -6.698412 -0.137571 -1.07807
H  -6.169188 -0.011474 0.618257
H  3.154873 -0.806043 1.408706
H  3.169529 -0.956929 -1.104623
H  3.331412 0.822251 -1.200531
H  -1.369305 -1.893068 1.278805
H  -1.158479 1.944912 -0.785156
H  1.075692 -1.847167 1.576051
H  1.266536 2.005341 -0.40275
H  4.512012 1.314486 1.615798
H  2.984632 1.386369 2.572445
H  3.125179 2.26462 1.022799
H  5.379175 1.103451 -2.214873
H  5.454589 -0.65433 -2.592845
H  6.80446 0.146841 -1.713832
H  6.677761 -1.344098 0.147764
H  5.268715 -2.290509 -0.455404
H  5.202097 -1.462798 1.140653
