program: Gaussian 09
title: 000217325
version: EM64L-G09RevD.01
frameworkgroup: C1[X(C4H5ClN2)]
method: RPBEPBE
basis: SDD
operation: Freq
keyword: #p
keyword: freq=noraman
keyword: PBEPBE/SDD
title: #p freq=noraman PBEPBE/SDD
converged: NO NO NO NO
title: Mulliken charges:
elementType: Cl N N C C C C H H H H H
charge: -0.098450 -0.391091 -0.070900 0.481149 -0.730355 -0.396698 -0.200385 0.321993 0.275322 0.282685 0.265990 0.260741
chargesum: 0.00000
title: Mulliken charges with hydrogens summed into heavy atoms:
elementType: Cl N N C C C C
charge: -0.098450 -0.069099 -0.070900 0.481149 -0.172347 -0.130708 0.060356
polarizability: 9.17582127e+01 -1.24107176e+00 6.02225417e+01 2.87214223e+00 -4.98989954e-01 3.97629616e+01
1716.lowfreq: -16.4107 -0.0021 -0.0010 -0.0008 5.0047 7.7658 64.8586 117.9548 303.3505
frequency: 64.6674 117.9457 303.3445 313.2318 558.0883 635.8025 657.4105 658.9533 706.8947 793.5373 833.3730 888.5637 892.6753 994.0228 1088.6801 1111.7861 1120.3905 1231.8418 1241.7573 1264.7066 1346.1378 1364.8902 1426.3846 1456.7660 1558.2958 3067.1421 3155.9848 3229.8302 3244.8444 3583.6509
redmass: 4.3585 9.0198 3.1822 4.2285 6.0741 2.8410 3.3812 1.3105 4.3131 1.4277 1.4767 1.6790 4.7384 3.7149 1.5260 1.4179 1.8192 1.1579 1.4149 2.7770 3.6859 2.9698 2.8671 1.1718 4.6456 1.0608 1.1079 1.0981 1.1001 1.0822
irintensity: 12.9536 3.9005 5.4083 7.6250 66.2181 47.4231 31.2947 113.4233 10.3076 32.5354 22.1688 3.4714 7.7638 9.2468 36.7934 7.2854 13.6059 16.0578 3.0170 38.1611 41.2547 10.5318 23.1118 5.3329 20.1411 17.9503 3.2792 3.2470 1.2836 46.5119
temp: 298.150 k
press: 1.00000 atm
elementType: 17 7 7 6 6 6 6 1 1 1 1 1
symmnumber: 1
zpe: 232743.1 jmol-1
zpe.correction: 0.088647 hartree
zpe.thermalcorrener: 0.094950 hartree
zpe.thermalcorrenthalpy: 0.095894 hartree
zpe.thermalcorrgfe: 0.057141 hartree
zpe.sumelectzpe: -724.461827 hartree
zpe.sumelectthermal: -724.455524 hartree
zpe.sumelectthermalent: -724.454580 hartree
zpe.sumelectthermalfe: -724.493333 hartree
dipole: 0.5209 -1.5639 2.5877
dipole: 3.0681
quadrupole: -60.7651 -39.3972 -48.6645
quadrupole: 6.6046 0.4656 -0.5336
quadrupole: -11.1562 10.2117 0.9444 6.6046 0.4656 -0.5336
hfenergy: -724.5504743 hartree
pointgroup: C01 [X(C4H5Cl1N2)]
dipole: 0.0889302 -1.1380257 0.3925182 debye
dipolederiv: -0.7412933 0.0863582 0.1464168 0.0729849 -0.2090619 -0.0207182 0.5949478 -0.089188 -0.4391687 -0.0735368 0.0880937 0.0188459 0.135168 -0.5541521 -0.0964752 0.0430381 -0.0700933 -0.2317321 -0.4724248 0.0454988 0.0227781 -0.0902248 -0.4064843 -0.0422019 -0.1499819 -0.0448457 -0.2609644 -0.4989423 0.1928615 0.0944974 0.1819534 0.1985789 0.0690364 -0.1148505 0.1738989 -0.085585 1.1257308 -0.2078947 -0.3292402 -0.1254206 0.189615 0.0149565 -0.5512074 0.0356046 0.5627578 0.2649663 -0.0158479 0.0474965 -0.1129118 0.1166057 0.1603337 0.1573923 0.092464 -0.0952102 0.0445651 -0.1889187 0.03487 -0.022274 0.3366571 0.1118685 0.0402246 0.1272701 -0.0269377 0.198826 0.0590561 -0.0154855 0.0452608 0.2309371 -0.0535267 -0.0214375 -0.0601225 0.3082389 -0.0276409 0.0232872 0.0466726 0.0759227 -0.0397965 0.0880539 0.0921499 0.0444889 -0.0153289 0.0370154 -0.0054357 0.0376665 -0.0642723 0.0256799 -0.0897119 0.0049404 -0.0666128 -0.0116397 0.0891033 -0.0355455 -0.0486357 -0.0535028 0.0383099 -0.0775154 -0.0534167 -0.0736519 0.1431729 0.053631 -0.041513 -0.0558825 -0.0426835 0.0731113 -0.0640998 -0.0417992 -0.0692121 0.152397 unknown
polarizability: 89.6190927|-7.1414917|54.4925839|-4.2898688|10.9282143|47.6320393 unknown
InChI: InChI=1S/C4H5ClN2/c5-1-4-2-6-3-7-4/h2-3,7H,1H2
charge 0 multiplicity 1
12 atoms
Cl 2.737503 -0.546262 -1.037152
N  -0.606911 -1.05744 -0.312413
N  -1.855706 0.77152 0.14689
C  0.260081 -0.142394 0.310663
C  1.678334 -0.416949 0.590695
C  -0.541471 0.979818 0.57624
C  -1.859871 -0.46526 -0.395148
H  -0.330645 -1.958657 -0.70164
H  1.8740 -1.387285 1.070989
H  2.145814 0.397197 1.158956
H  -0.247937 1.908595 1.060752
H  -2.722391 -0.950683 -0.84513
