program: Gaussian 09
title: 000217318
version: EM64L-G09RevD.01
frameworkgroup: C1[X(C23H27NO3)]
method: RPBEPBE
basis: SDD
operation: Freq
keyword: #p
keyword: freq=noraman
keyword: PBEPBE/SDD
title: #p freq=noraman PBEPBE/SDD
converged: YES YES NO NO
title: Mulliken charges:
elementType: O O O N C C C C C C C C C C C C C C C C C C C C C C C H H H H H H H H H H H H H H H H H H H H H H H H H H H
charge: -0.347251 -0.219758 -0.449700 -0.062178 -0.151422 -0.140488 -0.486479 -0.483229 -0.468763 -0.493082 0.055776 -0.645521 0.201468 -0.086527 -0.438815 0.428952 0.325104 -0.379799 -0.358225 -0.380268 -0.393569 -0.246921 -0.250289 -0.244687 -0.250235 -0.245695 -0.243126 0.235331 0.237595 0.224710 0.235347 0.234338 0.218513 0.224968 0.229226 0.220180 0.224487 0.252309 0.229617 0.229702 0.196519 0.219978 0.234776 0.234154 0.271334 0.260528 0.307953 0.374483 0.224708 0.226685 0.226154 0.225833 0.228194 0.227106
chargesum: 0.00000
title: Mulliken charges with hydrogens summed into heavy atoms:
elementType: O O O N C C C C C C C C C C C C C C C C C C C C C C C
charge: -0.347251 -0.219758 -0.075217 -0.062178 0.083909 0.097107 -0.026422 -0.030378 -0.014569 -0.048415 0.308085 0.010317 0.201468 -0.086527 0.015939 0.428952 0.325104 -0.145645 -0.086891 -0.119740 -0.085617 -0.022214 -0.023604 -0.018534 -0.024402 -0.017500 -0.016020
polarizability: 2.84361810e+02 -2.90501032e+00 2.76053825e+02 1.29488262e+01 8.53489736e+00 2.01721404e+02
1716.lowfreq: -14.8476 -2.8069 -0.0011 -0.0008 -0.0007 2.1681 8.5795 21.9665 32.5679
frequency: -9.3390 21.6493 32.4287 44.7643 47.2773 63.4672 72.6379 94.2750 133.9201 140.0456 154.2043 175.2628 175.8899 200.2141 207.2805 222.1795 244.3189 248.8824 266.0598 280.4747 296.8434 319.5127 322.4648 349.2257 364.5260 371.1466 401.2867 404.2413 434.2445 455.5653 482.1175 492.7597 503.5739 544.5899 577.6604 591.3169 615.4233 616.8489 646.2166 650.0076 692.8502 697.1085 703.5150 706.9951 740.3557 742.5998 765.6568 771.7479 772.9628 782.5489 818.8741 834.9211 844.2471 851.2423 859.6072 868.4239 893.6038 916.0622 919.6514 935.2717 947.1238 963.3244 977.1775 977.2927 979.8566 982.1752 987.5830 991.5378 991.9054 994.9909 999.2686 1011.9425 1029.2551 1031.5336 1036.9281 1044.0674 1047.8530 1071.1624 1087.7141 1092.8603 1108.1831 1110.9658 1115.0468 1128.5268 1149.2913 1155.8263 1168.0196 1173.5858 1174.2095 1197.1067 1197.6532 1203.4387 1204.3239 1205.6493 1224.5671 1240.9606 1246.1633 1257.6361 1273.4391 1290.3968 1293.8181 1310.9280 1315.2710 1324.0127 1327.8839 1339.9865 1347.0942 1354.2377 1367.8915 1375.2117 1379.4267 1397.8421 1429.7447 1434.0986 1436.8460 1449.1548 1461.8511 1465.1151 1466.8072 1468.7209 1482.5984 1483.1924 1483.9067 1491.9135 1586.3398 1590.9095 1606.9794 1610.8636 1624.8413 2886.0467 2961.4252 3003.8433 3005.2893 3007.6536 3017.8409 3026.2886 3029.5294 3044.3527 3054.0127 3058.3307 3067.7907 3070.4933 3076.3970 3081.0310 3083.3179 3122.1492 3123.3634 3130.8574 3131.7524 3143.1706 3144.3166 3151.1648 3158.2337 3164.9856 3170.5768 3475.2766
redmass: 3.7458 4.8054 3.8859 4.2761 4.1766 5.3601 4.7667 4.6145 5.4651 6.0206 4.8024 3.5279 2.3213 1.3170 2.2301 2.9052 4.6603 4.3329 3.9339 2.2954 4.7675 4.2821 4.3433 3.8291 2.8044 2.8155 2.8306 2.8375 3.8330 3.0041 4.3099 3.5331 3.4231 3.3223 1.2501 2.8913 6.2126 6.2582 4.4118 5.8823 4.7849 7.1428 1.7033 1.6962 4.5134 4.8678 1.9969 2.1014 2.8923 1.9529 2.5532 2.4090 3.1633 1.2575 1.2464 1.5754 3.9473 2.3742 1.7276 1.8321 3.3958 2.0642 1.4019 1.8184 2.3737 1.9497 2.4636 4.5375 3.7948 1.4020 1.4236 3.4090 2.1836 2.1462 2.2423 1.7029 3.6218 2.0172 1.8259 1.8195 1.9881 1.6300 1.4792 1.9744 1.3020 2.0087 2.7962 1.0666 1.0548 1.4510 1.2363 1.8222 1.3621 1.7502 1.4334 1.5632 1.4385 1.2740 1.4004 1.4552 1.5570 1.3221 1.3278 1.3587 1.3159 1.3531 1.3958 1.4966 1.3549 6.4342 8.3030 1.1700 1.1628 2.2421 2.2417 1.0895 1.0953 1.0770 1.0596 1.0703 2.1640 2.1005 1.0559 1.0881 5.9392 6.1402 5.8855 6.1436 10.6433 1.0534 1.0677 1.0595 1.0592 1.0600 1.0631 1.0761 1.0860 1.0884 1.0899 1.1021 1.0959 1.1036 1.1035 1.1006 1.1042 1.0847 1.0844 1.0876 1.0887 1.0920 1.0940 1.0961 1.0981 1.1015 1.0974 1.0640
irintensity: 0.0425 0.6561 0.1524 0.4920 0.0440 0.5983 0.5366 0.6425 0.1490 0.6425 0.9302 5.4125 0.9884 0.2147 0.7218 4.5076 0.5746 3.2320 4.0696 0.4299 0.0303 2.4244 1.7477 2.5598 3.0775 1.0461 0.3264 0.1036 10.4658 0.6350 2.2192 3.7126 6.0269 4.2615 152.5636 3.4601 0.7495 1.3285 21.5522 12.3902 9.8375 2.7547 44.5409 71.3778 0.8722 0.6362 42.2493 15.6039 19.0715 16.4113 0.3818 9.3229 4.4186 0.3198 1.2459 0.0557 5.4001 6.7650 8.9665 39.2879 100.4367 4.0088 0.1780 0.6671 7.6659 16.9379 64.6810 3.3744 2.0224 4.9154 10.0363 42.3154 73.5100 9.3351 30.5680 16.0283 50.4248 28.8466 78.4348 94.4025 167.6423 34.1507 58.7208 31.6654 1.1040 0.4875 2.9194 0.1607 0.1129 1.9630 1.3118 1.1326 1.6915 16.5696 5.7130 1.6845 51.4181 1.9254 0.5452 9.2197 14.4355 4.1866 3.0333 0.5164 6.1485 16.2340 12.5651 2.7118 5.6351 0.0774 0.3470 41.8623 5.6947 14.2055 6.0517 6.4051 10.3074 6.3507 11.4898 12.8538 29.8087 21.7747 2.7429 24.8456 1.8989 0.4631 14.6577 4.0732 105.4327 115.0357 53.5235 14.9564 23.9482 16.4607 39.8668 48.9756 7.6115 56.3934 10.8788 8.7654 24.9740 11.0034 33.9439 32.1367 68.6010 0.1258 1.5505 2.1464 11.6385 23.9868 21.7384 34.3806 19.4782 21.9238 16.4501 154.3380
temp: 298.150 k
press: 1.00000 atm
elementType: 8 8 8 7 6 6 6 6 6 6 6 6 6 6 6 6 6 6 6 6 6 6 6 6 6 6 6 1 1 1 1 1 1 1 1 1 1 1 1 1 1 1 1 1 1 1 1 1 1 1 1 1 1 1
symmnumber: 1
zpe: 1181614.8 jmol-1
zpe.correction: 0.450053 hartree
zpe.thermalcorrener: 0.473435 hartree
zpe.thermalcorrenthalpy: 0.474379 hartree
zpe.thermalcorrgfe: 0.397006 hartree
zpe.sumelectzpe: -1171.061934 hartree
zpe.sumelectthermal: -1171.038552 hartree
zpe.sumelectthermalent: -1171.037608 hartree
zpe.sumelectthermalfe: -1171.114982 hartree
dipole: 2.6925 -0.1079 -1.5836
dipole: 3.1255
quadrupole: -135.7513 -148.0012 -171.3636
quadrupole: -0.5955 -1.7785 -2.8455
quadrupole: 15.9541 3.7042 -19.6583 -0.5955 -1.7785 -2.8455
hfenergy: -1171.5119871 hartree
pointgroup: C01 [X(C23H27N1O3)]
dipole: 1.0085467 0.5506094 -0.4378998 debye
polarizability: 285.8011323|-3.5521048|246.6046427|6.5565471|37.9011031|229.7312648 unknown
InChI: InChI=1S/C23H27NO3/c1-24-19-12-13-20(24)15-21(14-19)27-22(26)23(16-25,17-8-4-2-5-9-17)18-10-6-3-7-11-18/h2-11,19-21,25H,12-16H2,1H3
charge 0 multiplicity 1
54 atoms
O  0.863395 -0.136994 0.543505
O  0.129412 -0.143504 -1.659894
O  -0.582162 -1.103828 2.581283
N  4.956209 0.496442 0.957742
C  4.586724 0.030721 -0.418623
C  4.139529 1.747171 1.074836
C  4.623347 1.325929 -1.3138
C  4.3193 2.486165 -0.304509
C  3.161781 -0.5788 -0.333387
C  2.66796 1.317955 1.319293
C  2.160124 0.50257 0.118054
C  6.409888 0.707362 1.152312
C  -0.095091 -0.381473 -0.453994
C  -1.435428 -0.876869 0.14966
C  -1.210946 -1.754333 1.439313
C  -2.161557 -1.825151 -0.835389
C  -2.254552 0.419936 0.403756
C  -1.439688 -2.742447 -1.64139
C  -2.591691 1.237888 -0.708658
C  -3.577659 -1.897152 -0.831799
C  -2.695231 0.804104 1.694741
C  -2.11629 -3.691312 -2.438714
C  -3.357174 2.409502 -0.536282
C  -4.256132 -2.848129 -1.624992
C  -3.4696 1.976193 1.863405
C  -3.528401 -3.74958 -2.434441
C  -3.803363 2.783635 0.753555
H  5.29727 -0.741283 -0.760754
H  4.491112 2.351861 1.928315
H  3.887776 1.27587 -2.135994
H  5.619832 1.451232 -1.772816
H  5.160983 3.199089 -0.254694
H  3.419117 3.063334 -0.581634
H  3.179956 -1.395098 0.411095
H  2.852696 -0.992308 -1.310437
H  2.021481 2.200441 1.478975
H  2.640911 0.694996 2.231675
H  1.90969 1.161447 -0.73299
H  6.933445 -0.257573 1.031839
H  6.588017 1.05923 2.183937
H  6.876581 1.441814 0.452651
H  -0.638047 -2.655874 1.135427
H  -2.200425 -2.087013 1.797352
H  -0.345465 -2.705855 -1.670435
H  -2.254387 0.947769 -1.710428
H  -4.152754 -1.199675 -0.213296
H  -2.410356 0.206781 2.564856
H  0.238885 -0.657584 2.237494
H  -1.541057 -4.383836 -3.063588
H  -3.608643 3.02649 -1.40639
H  -5.351288 -2.883798 -1.610401
H  -3.805117 2.25935 2.867707
H  -4.053408 -4.485482 -3.053743
H  -4.401009 3.692176 0.889794
