program: Gaussian 09
title: 000217313
version: EM64L-G09RevD.01
frameworkgroup: C1[X(C12H19O3PS)]
method: RPBEPBE
basis: SDD
operation: Freq
keyword: #p
keyword: freq=noraman
keyword: PBEPBE/SDD
title: #p freq=noraman PBEPBE/SDD
converged: YES YES NO NO
title: Mulliken charges:
elementType: S P O O O C C C C C C C C C C C C H H H H H H H H H H H H H H H H H H H
charge: 0.001536 1.023856 -0.545378 -0.476944 -0.577599 -0.606225 -0.331417 0.365416 -0.667013 0.443649 -0.340005 -0.377116 -0.244641 -0.337307 -0.398227 -0.804971 -0.649014 0.288517 0.275428 0.218275 0.222169 0.214622 0.225802 0.216052 0.233117 0.227053 0.297938 0.251158 0.232533 0.233438 0.222646 0.232803 0.230688 0.208842 0.252008 0.238313
chargesum: 0.00000
title: Mulliken charges with hydrogens summed into heavy atoms:
elementType: S P O O O C C C C C C C C C C C C
charge: 0.001536 1.023856 -0.545378 -0.476944 -0.577599 -0.042280 0.109027 0.365416 -0.010537 0.443649 -0.042067 -0.125958 0.215529 -0.104775 -0.164788 -0.118835 0.050148
polarizability: 2.43568767e+02 5.58259044e+00 1.70039616e+02 -6.66963688e+00 -3.77285970e+00 1.60240672e+02
1716.lowfreq: -11.5068 -9.3529 -6.1058 0.0014 0.0019 0.0021 10.9315 16.9223 25.7904
frequency: 9.0353 16.8905 25.2943 30.2913 41.2284 54.4987 55.9687 73.9098 88.7244 106.4567 120.3126 136.8327 157.3444 185.8875 206.2431 222.6707 227.0657 230.7320 295.1447 309.2275 324.3139 339.9717 353.2298 363.7120 408.3704 410.8814 434.9181 494.8606 524.6037 579.8827 634.8449 647.4797 674.6069 710.9608 753.1892 762.9090 801.4556 824.3275 828.7324 840.3663 860.4699 864.5093 898.6111 948.4614 973.1361 987.1755 1004.3275 1007.9648 1040.6503 1041.6460 1047.3848 1054.0212 1093.9315 1102.0567 1118.5202 1139.8798 1159.2370 1194.1117 1216.7990 1221.6813 1246.0417 1263.9947 1288.0890 1304.5866 1331.5270 1345.8991 1366.3058 1389.1979 1391.1275 1398.7815 1407.4483 1456.1453 1458.2892 1468.5830 1471.3283 1475.0241 1476.2376 1476.4376 1484.9258 1486.0468 1491.9239 1587.4841 1614.9520 2976.7430 2980.8725 2990.2951 2994.8503 3001.5463 3035.8401 3044.1897 3055.2165 3076.2779 3080.7111 3083.2493 3083.7506 3086.3903 3111.8579 3121.5271 3126.3145 3128.6275 3160.8966 3163.8377
redmass: 4.5728 3.1737 1.1551 3.7698 2.9696 1.6786 2.4802 4.3196 4.9809 3.2805 4.0849 3.9513 4.5419 6.7086 3.6493 1.1298 6.1489 1.3476 5.4094 4.8072 3.7410 5.2281 4.9570 3.7947 4.0129 2.9845 11.0708 3.5369 4.5555 7.8810 6.8848 6.8513 5.2645 3.2064 1.0780 5.3107 1.1197 1.4344 6.5160 1.2753 1.1806 3.9613 1.9251 1.3285 1.3476 1.4016 2.6392 2.9376 8.1337 3.1743 1.5422 1.2256 2.2054 2.1597 1.2875 1.5370 2.6090 1.2642 1.4055 3.4770 1.1944 1.1236 1.1010 1.2783 1.3992 1.2239 5.8212 1.1989 1.2289 1.2482 3.1099 1.0888 1.0428 1.0739 1.0472 1.0519 1.0423 1.1000 1.0685 1.0810 2.4281 6.5379 6.3310 1.0374 1.0352 1.0370 1.0598 1.0610 1.0574 1.1012 1.0974 1.1037 1.1017 1.0994 1.0989 1.0967 1.1028 1.1098 1.0897 1.0893 1.0953 1.0963
irintensity: 1.3648 0.2716 0.4495 0.2491 2.3310 0.2625 1.0869 1.8367 2.1480 0.4680 0.4546 0.8530 1.6567 0.4400 6.3511 0.0638 5.1488 2.2028 7.0381 7.4294 4.0125 9.5622 4.4191 3.4469 32.4159 0.6035 74.9111 46.7645 46.6857 94.7822 30.2900 94.7732 9.8150 0.1492 10.2228 105.7741 5.2728 51.0311 152.5304 16.1377 0.9756 134.9029 11.4150 4.2626 2.0550 0.3144 119.0972 29.3267 78.1564 7.9857 12.2031 11.7737 8.0422 25.2994 22.2081 10.2105 192.2019 56.7026 0.0910 6.8088 9.0076 0.1426 0.3046 0.1244 6.5284 8.7402 7.0141 11.0645 19.5841 8.1653 1.1205 11.8900 9.2446 4.7238 12.5738 4.1965 13.4402 17.3871 4.6067 12.8132 183.1254 7.1601 16.7644 42.8029 33.7765 17.5739 17.1830 23.8391 11.0030 3.3719 21.1989 5.7121 44.2447 41.0604 19.2759 27.5868 28.9413 16.4018 18.5296 17.7297 4.1971 4.6083
temp: 298.150 k
press: 1.00000 atm
elementType: 16 15 8 8 8 6 6 6 6 6 6 6 6 6 6 6 6 1 1 1 1 1 1 1 1 1 1 1 1 1 1 1 1 1 1 1
symmnumber: 1
zpe: 755234.3 jmol-1
zpe.correction: 0.287654 hartree
zpe.thermalcorrener: 0.309129 hartree
zpe.thermalcorrenthalpy: 0.310073 hartree
zpe.thermalcorrgfe: 0.231711 hartree
zpe.sumelectzpe: -1432.305160 hartree
zpe.sumelectthermal: -1432.283685 hartree
zpe.sumelectthermalent: -1432.282741 hartree
zpe.sumelectthermalfe: -1432.361103 hartree
dipole: -0.6846 -1.5189 -4.0972
dipole: 4.4230
quadrupole: -102.5152 -111.2057 -121.8584
quadrupole: -3.1973 -3.6079 -7.7044
quadrupole: 9.3446 0.6541 -9.9987 -3.1973 -3.6079 -7.7044
hfenergy: -1432.5928139 hartree
pointgroup: C01 [X(C12H19O3P1S1)]
dipole: -0.2758018 0.8322007 1.5031636 debye
polarizability: 242.0986442|-8.8656397|169.6296944|10.0863332|-5.7565237|162.1207169 unknown
InChI: InChI=1S/C12H19O3PS/c1-4-10-17-16(13,14-5-2)15-12-8-6-11(3)7-9-12/h6-9H,4-5,10H2,1-3H3
charge 0 multiplicity 1
36 atoms
S  3.531995 -1.40568 -0.060037
P  1.484591 -1.796464 -0.983034
O  0.580335 -0.676201 0.037733
O  1.067823 -3.375928 -0.43422
O  1.275187 -1.635891 -2.546944
C  3.590605 0.489197 -0.334402
C  4.924826 1.01631 0.221331
C  -0.757158 -0.240153 -0.216245
C  5.029719 2.548037 0.031145
C  -3.403036 0.744796 -0.514042
C  -1.318509 -0.143275 -1.51038
C  -1.490367 0.146612 0.925362
C  1.044228 -3.705872 1.027567
C  -2.637501 0.342407 -1.639444
C  -2.804211 0.640546 0.767036
C  -4.815599 1.278243 -0.683361
C  -0.397831 -3.748894 1.53151
H  2.723209 0.919612 0.190349
H  3.504195 0.669986 -1.418393
H  5.005631 0.766799 1.296595
H  5.767815 0.517015 -0.293044
H  4.211352 3.073553 0.556931
H  5.987789 2.923934 0.432637
H  4.979285 2.822893 -1.038561
H  1.526586 -4.696442 1.080114
H  1.658181 -2.973914 1.586913
H  -0.741319 -0.445122 -2.389837
H  -1.0262 0.065877 1.913325
H  -3.077321 0.412946 -2.641864
H  -3.370509 0.944202 1.655534
H  -5.302466 1.450143 0.292006
H  -4.819493 2.238846 -1.232989
H  -5.447243 0.574377 -1.256429
H  -0.414364 -4.100127 2.580903
H  -0.869284 -2.752652 1.488967
H  -0.997942 -4.447818 0.92447
