program: Gaussian 09
title: 000217310
version: EM64L-G09RevD.01
frameworkgroup: C1[X(C10H20NO2)]
method: RPBEPBE
basis: SDD
operation: Freq
keyword: #p
keyword: freq=noraman
keyword: PBEPBE/SDD
title: #p freq=noraman PBEPBE/SDD
converged: YES YES NO NO
title: Mulliken charges:
elementType: O O N C C C C C C C C C C H H H H H H H H H H H H H H H H H H H H
charge: -0.270851 -0.217511 -0.077346 -0.337211 -0.344429 -0.445882 -0.440602 -0.350313 -0.398748 -0.601330 -0.371411 0.304819 -0.735288 0.264921 0.263404 0.295168 0.253609 0.262329 0.235020 0.237894 0.259377 0.310962 0.268659 0.262482 0.216288 0.272674 0.285432 0.266446 0.280458 0.260867 0.247628 0.276847 0.265637
chargesum: 1.00000
title: Mulliken charges with hydrogens summed into heavy atoms:
elementType: O O N C C C C C C C C C C
charge: -0.270851 -0.217511 -0.077346 0.191114 0.204348 0.051467 0.056670 0.229308 0.080022 0.223222 0.169914 0.304819 0.054824
polarizability: 1.28291680e+02 -4.59147739e+00 1.11706300e+02 2.85425159e-01 1.70547477e+00 1.01369473e+02
1716.lowfreq: -9.6561 -0.0007 -0.0005 0.0003 5.2063 12.2805 26.7352 36.1012 51.2011
frequency: 26.4932 35.7240 51.1773 66.8792 123.3495 148.9131 191.5800 213.8763 231.7586 264.7004 311.6958 329.0522 343.3438 390.0254 412.9715 421.5384 440.7766 466.1234 506.6306 552.5860 578.2092 621.5613 669.5442 731.8894 770.7739 813.5017 835.2029 845.3702 860.7281 899.2991 929.3892 941.5553 967.9101 981.3406 994.4347 1006.9640 1039.0246 1044.3194 1062.1344 1083.2124 1112.9779 1116.7061 1163.5136 1171.8932 1177.3025 1181.5753 1215.0470 1252.0147 1267.3432 1281.2918 1300.6895 1323.2665 1337.5040 1347.2217 1354.9976 1361.9285 1373.0620 1382.6711 1390.8410 1397.7649 1428.3082 1442.8804 1448.1540 1451.2624 1452.2613 1462.1291 1468.6743 1469.8614 1471.6029 1486.3481 1489.1538 1498.7142 1669.8669 2994.9498 3005.7875 3006.9741 3007.8089 3014.8678 3020.1253 3023.3176 3028.8821 3033.5493 3060.8779 3063.4362 3078.4709 3090.5880 3098.7660 3099.1390 3110.6640 3116.3821 3142.9354 3143.6260 3163.4635
redmass: 3.0126 2.5139 1.4512 3.4054 3.2245 3.2325 1.5194 2.4766 3.9838 1.6826 2.5985 2.2238 1.8621 2.1600 2.1182 2.9020 2.5005 2.9730 2.2988 2.0155 2.8178 3.5740 3.1980 3.8823 1.6871 3.2455 1.9658 2.1705 1.9442 3.1726 1.5855 2.2176 1.9336 2.0666 2.1023 2.2544 1.7469 2.1764 2.6840 2.2328 1.8712 1.1764 2.3725 2.8589 1.4425 1.7074 1.4305 1.2057 1.2333 1.1275 1.1954 1.3545 1.2482 1.3229 1.4218 1.3870 1.3710 1.2269 1.2209 1.3365 1.1472 1.0870 1.0505 1.0610 1.0825 1.0644 1.0789 1.0744 1.0901 1.0759 1.0844 1.0568 9.7702 1.0680 1.0624 1.0624 1.0397 1.0603 1.0618 1.0627 1.0615 1.0370 1.0993 1.0973 1.1006 1.1071 1.1039 1.0929 1.1050 1.1014 1.1045 1.1028 1.1026
irintensity: 1.1925 1.4259 1.2413 1.9771 3.9307 2.8445 1.2856 5.7348 7.4395 2.8626 2.2273 2.9078 0.9078 1.2765 0.2269 3.8038 2.3027 0.3039 2.1148 3.5515 9.2920 9.4621 6.0004 49.7334 2.2785 20.0905 2.8394 6.7636 34.4450 45.4751 20.0447 15.4318 6.8743 10.4790 23.9256 42.7037 18.8108 18.9452 25.4284 2.5811 0.3646 0.9912 89.9006 180.6791 6.7921 3.1126 1.5937 9.5105 6.7319 2.9769 8.4848 12.2748 1.4373 2.1313 0.2974 1.6989 3.8969 2.8991 58.1737 0.7917 17.4177 28.1019 31.5964 15.1026 17.0583 13.0901 35.6272 9.6351 15.6028 30.1337 27.4338 23.6089 144.2418 11.2903 14.3046 16.4239 1.2016 5.6228 1.5770 8.4855 12.3876 6.4641 7.8836 13.7537 20.5510 12.1835 1.9288 2.8289 4.2921 8.1572 2.8067 3.2343 4.1366
temp: 298.150 k
press: 1.00000 atm
elementType: 8 8 7 6 6 6 6 6 6 6 6 6 6 1 1 1 1 1 1 1 1 1 1 1 1 1 1 1 1 1 1 1 1
symmnumber: 1
zpe: 773140.5 jmol-1
zpe.correction: 0.294474 hartree
zpe.thermalcorrener: 0.308775 hartree
zpe.thermalcorrenthalpy: 0.309720 hartree
zpe.thermalcorrgfe: 0.252271 hartree
zpe.sumelectzpe: -596.962666 hartree
zpe.sumelectthermal: -596.948364 hartree
zpe.sumelectthermalent: -596.947420 hartree
zpe.sumelectthermalfe: -597.004869 hartree
dipole: 4.3553 -1.3441 1.7552
dipole: 4.8843
quadrupole: -52.8921 -62.0407 -76.1656
quadrupole: -4.5391 -6.1861 -0.9350
quadrupole: 10.8074 1.6588 -12.4661 -4.5391 -6.1861 -0.9350
hfenergy: -597.2571395 hartree
pointgroup: C01 [X(C10H20N1O2)]
dipole: -1.7027951 0.2572259 -0.8526208 debye
polarizability: 128.0651109|2.5486261|106.1570845|4.2800902|5.5331476|107.1452573 unknown
InChI: InChI=1S/C10H20NO2/c1-10(12)13-9-8-11(2)6-4-3-5-7-11/h3-9H2,1-2H3
charge 1 multiplicity 1
33 atoms
O  2.071357 0.39258 -0.540808
O  2.972903 -1.330725 0.744378
N  -1.013175 -0.409687 -0.585665
C  -2.20925 -1.366064 -0.312672
C  -0.785597 0.486416 0.664127
C  -3.48277 -0.640484 0.147345
C  -2.056009 1.23096 1.101812
C  0.223204 -1.311857 -0.827805
C  -3.220864 0.254789 1.378882
C  -1.292345 0.443644 -1.814976
C  1.473648 -0.64516 -1.411872
C  2.904651 -0.108239 0.509011
C  3.637326 1.011855 1.194025
H  -1.856883 -2.063307 0.468742
H  -2.373854 -1.935042 -1.244423
H  0.044062 1.164756 0.412066
H  -0.449344 -0.20087 1.461765
H  -4.226954 -1.421639 0.388339
H  -3.921747 -0.048123 -0.677468
H  -2.350649 1.988974 0.352027
H  -1.798172 1.794286 2.017403
H  0.467671 -1.789815 0.134969
H  -0.105102 -2.096106 -1.534832
H  -4.134763 0.815782 1.63803
H  -2.975522 -0.377418 2.25507
H  -2.254599 0.957339 -1.695987
H  -0.494394 1.191354 -1.926953
H  -1.330934 -0.20753 -2.70246
H  2.207981 -1.457067 -1.568896
H  1.294307 -0.135217 -2.37046
H  3.062372 1.95038 1.168054
H  4.591813 1.193006 0.665424
H  3.876032 0.728328 2.230007
