program: Gaussian 09
title: 000217312
version: EM64L-G09RevD.01
frameworkgroup: C1[X(C11H16NO5PS)]
method: RPBEPBE
basis: SDD
operation: Freq
keyword: #p
keyword: freq=noraman
keyword: PBEPBE/SDD
title: #p freq=noraman PBEPBE/SDD
converged: YES YES NO NO
title: Mulliken charges:
elementType: S P O O O O O N C C C C C C C C C C C H H H H H H H H H H H H H H H H
charge: 0.035477 1.004201 -0.515080 -0.460346 -0.583002 -0.212152 -0.215278 0.022319 -0.672790 -0.300851 0.388947 -0.665779 -0.248447 -0.293953 -0.344704 0.381583 -0.339860 -0.335122 -0.642758 0.273428 0.305131 0.240502 0.213216 0.209321 0.226581 0.224228 0.225945 0.239416 0.296148 0.265997 0.288971 0.290094 0.237833 0.241281 0.219504
chargesum: 0.00000
title: Mulliken charges with hydrogens summed into heavy atoms:
elementType: S P O O O O O N C C C C C C C C C C C
charge: 0.035477 1.004201 -0.515080 -0.460346 -0.583002 -0.212152 -0.215278 0.022319 -0.094231 0.152867 0.388947 -0.005649 0.216913 0.002195 -0.078707 0.381583 -0.050889 -0.045028 0.055861
polarizability: 3.08437514e+02 3.65905525e+00 1.62732539e+02 -1.13535093e+01 2.33042114e+01 1.46630847e+02
1716.lowfreq: -15.3224 -6.3207 -0.0010 0.0018 0.0019 2.4261 11.9008 14.4437 20.0180
frequency: 11.3635 13.9325 18.5551 27.9629 45.0525 63.8346 70.2219 73.0995 79.8052 109.1664 120.9694 148.3667 169.4439 188.3902 196.7675 220.5576 225.6126 230.6366 268.7585 280.3912 306.3546 326.9118 328.9083 362.2735 377.8982 414.8188 430.6286 486.3534 493.0710 505.2830 550.9890 623.8952 625.3325 652.5143 663.4908 668.5514 730.4834 736.0424 776.0538 801.7997 832.2616 833.6434 848.2873 855.9006 863.5014 898.2937 981.9240 989.0847 998.4382 1009.4989 1034.4082 1040.4162 1073.7339 1091.1294 1094.4008 1107.9130 1108.4690 1139.8447 1169.2411 1201.2162 1221.4000 1224.3035 1259.0000 1269.6761 1290.5762 1293.4138 1329.6573 1349.9627 1357.6208 1389.6834 1392.8164 1399.1378 1428.1928 1434.1730 1457.5528 1467.0172 1471.0812 1471.6158 1475.9775 1483.4530 1483.6413 1590.7678 1602.2632 2981.7005 2990.7233 2992.1636 2999.0984 3023.1765 3042.4098 3079.2558 3080.2745 3085.8282 3088.4143 3103.8063 3112.0765 3158.9050 3170.7065 3186.0991 3190.5847
redmass: 4.5668 5.2793 5.3340 4.1980 2.8943 1.6606 7.0302 4.8948 5.7296 5.2459 7.0527 3.3390 2.8863 8.1791 3.4486 1.6099 1.3148 2.5901 6.4913 7.3868 6.8673 6.5139 4.9162 5.9898 9.5481 3.0161 4.2342 8.3923 3.5519 8.4932 7.7917 7.4849 7.5110 5.0904 4.7355 10.0203 4.9626 1.0972 10.0285 1.1162 3.9873 1.4281 1.2395 3.3908 1.6964 1.8789 1.3250 1.3502 3.0360 2.7683 13.4868 3.0530 1.2637 2.2122 3.1545 2.1215 1.2833 1.5170 1.5752 2.9471 1.3464 5.9610 1.1925 1.1181 1.1084 1.2796 1.3858 1.2123 7.9278 1.1983 1.2245 10.2100 4.0293 1.0880 1.0466 1.0730 1.0710 2.2566 1.0427 1.0708 1.0633 7.7228 6.7215 1.0355 1.0601 1.0375 1.0629 1.0579 1.1016 1.1010 1.1014 1.0998 1.0972 1.1073 1.1028 1.0919 1.0890 1.0951 1.0974
irintensity: 0.1067 0.2006 0.3628 0.2171 1.8294 0.1979 0.0619 1.1904 1.7551 1.1753 1.7304 3.7658 5.7243 13.0466 1.5713 0.6905 0.6915 1.6155 6.1441 7.2938 7.8805 6.4719 5.3851 8.2344 28.3785 0.1412 36.5484 113.4968 40.5349 56.5725 11.3531 36.1445 113.6801 21.6789 23.7081 163.4302 8.0341 9.7424 22.5235 3.9332 248.0533 48.0214 10.9075 51.5239 125.0752 16.8674 1.7817 0.1315 11.2445 116.3935 86.2942 2.3019 5.8934 17.0124 20.0268 6.8741 30.0983 4.8817 382.5667 306.0782 0.5166 328.8501 7.8912 0.0769 3.2039 0.4008 5.0454 9.7410 84.8484 12.9462 18.7452 35.6119 28.2670 11.5497 18.7760 2.2509 1.8163 113.5983 14.4362 9.9127 31.6150 74.0330 194.9274 35.3015 16.1181 10.2781 25.5992 11.1636 6.2139 36.9122 3.0615 32.4653 32.8334 8.5126 23.0339 0.4687 0.8256 1.0040 3.8814
temp: 298.150 k
press: 1.00000 atm
elementType: 16 15 8 8 8 8 8 7 6 6 6 6 6 6 6 6 6 6 6 1 1 1 1 1 1 1 1 1 1 1 1 1 1 1 1
symmnumber: 1
zpe: 687998.4 jmol-1
zpe.correction: 0.262045 hartree
zpe.thermalcorrener: 0.284114 hartree
zpe.thermalcorrenthalpy: 0.285058 hartree
zpe.thermalcorrgfe: 0.205427 hartree
zpe.sumelectzpe: -1597.382853 hartree
zpe.sumelectthermal: -1597.360784 hartree
zpe.sumelectthermalent: -1597.359840 hartree
zpe.sumelectthermalfe: -1597.439471 hartree
dipole: -7.9755 3.6313 0.6342
dipole: 8.7862
quadrupole: -151.4702 -122.3177 -129.0261
quadrupole: 4.9734 3.1028 -4.1407
quadrupole: -17.1989 11.9537 5.2452 4.9734 3.1028 -4.1407
hfenergy: -1597.6448981 hartree
pointgroup: C01 [X(C11H16N1O5P1S1)]
dipole: 3.0172884 -0.743379 1.5140957 debye
polarizability: 305.582974|14.9044244|131.5377936|18.1045959|-5.4151122|180.6801326 unknown
InChI: InChI=1S/C11H16NO5PS/c1-3-9-19-18(15,16-4-2)17-11-7-5-10(6-8-11)12(13)14/h5-8H,3-4,9H2,1-2H3
charge 0 multiplicity 1
35 atoms
S  3.367598 0.723368 1.623978
P  1.995745 -0.016921 -0.032001
O  0.489693 0.238233 0.86112
O  2.106824 -1.73275 -0.18585
O  2.12168 0.677628 -1.453494
O  -5.054587 0.045186 -2.334486
O  -5.7830 0.038806 -0.171462
N  -4.842633 0.061461 -1.059229
C  4.735541 1.328099 0.423991
C  5.589574 0.190903 -0.153486
C  -0.802416 0.18494 0.302561
C  6.707247 0.748512 -1.064977
C  2.313061 -2.629151 0.995372
C  -1.062798 0.178548 -1.091822
C  -1.857187 0.163934 1.249118
C  -3.443595 0.107312 -0.586901
C  -2.396874 0.134713 -1.535074
C  -3.188171 0.126449 0.804068
C  0.999363 -2.970673 1.700119
H  5.327086 2.016441 1.053516
H  4.228349 1.906704 -0.366631
H  4.945513 -0.49473 -0.737276
H  6.031043 -0.399697 0.671484
H  7.386312 1.419362 -0.50642
H  7.313795 -0.07518 -1.481506
H  6.283382 1.317881 -1.912263
H  3.043637 -2.157296 1.68137
H  2.772449 -3.520384 0.537116
H  -0.241444 0.222815 -1.813443
H  -1.613317 0.183655 2.314613
H  -2.639339 0.127254 -2.600778
H  -4.02608 0.109533 1.505488
H  0.265758 -3.376797 0.982988
H  0.559999 -2.087826 2.19447
H  1.188891 -3.741129 2.471027
