program: Gaussian 09
title: 000217307
version: EM64L-G09RevD.01
frameworkgroup: C1[X(C10H10N8O2)]
method: RPBEPBE
basis: SDD
operation: Freq
keyword: #p
keyword: freq=noraman
keyword: PBEPBE/SDD
title: #p freq=noraman PBEPBE/SDD
converged: YES YES NO NO
title: Mulliken charges:
elementType: O O N N N N N N N N C C C C C C C C C C H H H H H H H H H H
charge: -0.221368 -0.221576 -0.078092 -0.253988 -0.101545 -0.110183 -0.611247 -0.604914 0.019336 -0.573367 -0.083398 0.267139 0.380681 0.186480 0.174832 -0.345888 -0.288466 -0.341195 -0.338744 0.014521 0.245898 0.255160 0.285702 0.282893 0.321564 0.385307 0.332951 0.346776 0.337531 0.337200
chargesum: 0.00000
title: Mulliken charges with hydrogens summed into heavy atoms:
elementType: O O N N N N N N N N C C C C C C C C C C
charge: -0.221368 -0.221576 -0.078092 -0.253988 -0.101545 -0.110183 0.095624 0.074813 0.019336 0.101364 -0.083398 0.267139 0.380681 0.186480 0.174832 -0.099990 -0.033306 -0.055493 -0.055851 0.014521
polarizability: 5.36462860e+02 4.06163980e+00 1.90144821e+02 -4.22983580e-01 -4.82645788e-01 6.66536262e+01
1716.lowfreq: -6.5486 -4.9827 -0.0005 -0.0004 0.0006 3.4974 13.7574 32.7833 56.9736
frequency: 13.0218 32.7813 56.9712 70.9564 73.8896 146.7396 166.6219 192.0221 201.1315 205.9287 248.8400 270.6461 315.6180 336.0815 346.7409 389.8394 401.8202 415.5327 458.4045 510.0227 510.9123 514.1623 520.5048 537.2092 540.7952 561.6891 575.4264 619.7402 625.4736 626.1875 630.2361 665.3827 666.8309 680.5298 722.7232 743.3281 767.1087 795.0040 805.4166 838.4274 868.8797 883.2169 910.2439 922.1431 974.0819 988.7742 990.7220 997.4071 1093.4341 1102.4854 1125.9418 1143.4676 1161.2523 1181.0609 1198.8437 1215.5020 1266.7272 1286.1908 1345.9296 1351.8067 1377.5931 1402.2008 1426.3772 1432.6697 1447.2135 1466.4814 1488.7818 1504.7991 1557.7204 1576.7159 1582.5674 1595.8255 1605.1409 1625.6455 3122.2423 3155.8511 3168.9204 3185.5313 3188.5035 3522.9332 3552.4045 3597.9782 3686.1516 3712.4080
redmass: 5.1708 7.1943 7.0210 7.4246 6.3597 7.8492 7.5852 7.8500 5.0890 7.7797 8.0047 5.1020 2.8292 3.1188 6.9983 4.1650 8.5147 3.0314 5.6800 5.0839 1.6938 1.9233 7.2764 1.2256 7.1395 1.0553 4.1409 1.3858 3.1651 1.3388 6.1848 4.5424 7.4841 6.0871 9.9630 4.7586 9.2627 8.6968 8.1861 1.2505 1.7016 7.2385 1.1200 2.7790 2.0125 1.3363 2.8133 1.3466 3.2581 1.3004 2.1383 2.4042 1.6745 2.5369 3.8692 5.3361 4.1957 1.4117 8.8396 8.6160 7.1968 7.1242 2.5240 4.7822 4.7270 2.4032 2.2679 2.1335 2.2743 4.9205 3.4966 1.8144 6.0430 2.3459 1.0685 1.0896 1.0876 1.0954 1.0966 1.0442 1.0443 1.0867 1.1050 1.1060
irintensity: 0.0208 0.0973 0.6764 0.2847 1.7922 4.0071 0.0595 0.1732 18.4647 0.2806 1.1716 9.7994 8.6620 6.7529 0.8968 11.0780 7.1861 0.0981 10.0460 1.0192 38.8960 184.9569 0.3327 160.8627 1.1129 10.1383 5.8882 259.8309 11.3178 44.2474 0.8161 35.2263 4.2953 0.5321 5.4839 3.1267 5.9659 25.8206 37.3831 0.0033 42.0260 0.6029 134.4510 22.7736 17.7780 0.2681 1.3310 0.2316 53.3040 23.9933 70.8031 46.5165 235.4870 105.8876 7.7561 1228.7097 260.4062 49.4464 451.3185 141.8403 190.1553 101.6312 65.4719 31.4966 74.6778 15.1952 86.5207 139.2982 823.8320 288.8359 447.6249 993.9262 27.2927 103.7383 88.8676 4.1887 1.6530 1.3519 1.0552 57.2409 306.6750 89.9860 76.2590 53.4498
temp: 298.150 k
press: 1.00000 atm
elementType: 8 8 7 7 7 7 7 7 7 7 6 6 6 6 6 6 6 6 6 6 1 1 1 1 1 1 1 1 1 1
symmnumber: 1
zpe: 566978.9 jmol-1
zpe.correction: 0.215951 hartree
zpe.thermalcorrener: 0.232915 hartree
zpe.thermalcorrenthalpy: 0.233859 hartree
zpe.thermalcorrgfe: 0.169463 hartree
zpe.sumelectzpe: -974.047214 hartree
zpe.sumelectthermal: -974.030249 hartree
zpe.sumelectthermalent: -974.029305 hartree
zpe.sumelectthermalfe: -974.093701 hartree
dipole: 9.3303 -0.0741 0.0127
dipole: 9.3306
quadrupole: -137.8583 -96.8682 -119.0702
quadrupole: 4.7031 -0.2286 0.1349
quadrupole: -19.9260 21.0640 -1.1380 4.7031 -0.2286 0.1349
hfenergy: -974.2631647 hartree
pointgroup: C01 [X(C10H10N8O2)]
dipole: -3.6709136 -0.0143142 -0.0100235 debye
polarizability: 536.3670764|-2.3562256|95.8840355|6.6794795|-52.5165234|161.0101953 unknown
InChI: InChI=1S/C10H10N8O2/c11-8-7(9(12)15-10(13)14-8)17-16-5-1-3-6(4-2-5)18(19)20/h1-4H,11-13H2
charge 0 multiplicity 1
30 atoms
O  6.316429 -0.41444 0.802414
O  6.016442 0.726025 -1.153949
N  -0.881709 0.180174 -0.314347
N  -0.077586 -0.331695 0.625397
N  -4.300835 -0.566831 1.081864
N  -4.448738 0.59763 -1.089946
N  -2.206857 -1.076377 2.015753
N  -2.517281 1.213654 -2.254782
N  5.561025 0.113443 -0.107447
N  -6.345796 -0.033246 0.102654
C  -2.236568 0.075215 -0.122252
C  1.309074 -0.179609 0.366407
C  4.10043 0.011409 0.05678
C  -2.938022 -0.531083 1.007287
C  -3.092631 0.632906 -1.162567
C  2.185742 -0.743235 1.339343
C  1.863654 0.485966 -0.769394
C  3.577967 -0.652567 1.191698
C  3.252831 0.581814 -0.92517
C  -4.978419 -0.001246 0.032486
H  1.747702 -1.249708 2.20518
H  1.186709 0.918391 -1.510051
H  4.265785 -1.078807 1.926294
H  3.702589 1.085989 -1.784757
H  -2.696068 -1.497868 2.805369
H  -1.170658 -1.018583 1.899045
H  -3.111298 1.604167 -2.982675
H  -1.499693 1.238597 -2.31018
H  -6.889696 0.374041 -0.653902
H  -6.790422 -0.463827 0.909545
