program: Gaussian 09
title: 000018635
version: EM64L-G09RevD.01
frameworkgroup: C1[X(C4H8OS)]
method: RPBEPBE
basis: SDD
operation: Freq
keyword: #pfreq=noraman
keyword: PBEPBE/SDD
title: #p freq=noraman PBEPBE/SDD
converged: YES YES NO NO
title: Mulliken charges:
elementType: S O C C C C H H H H H H H H
charge: 0.152109 -0.197225 -0.638768 -0.403105 -0.046907 -0.837074 0.264396 0.264772 0.246908 0.246841 0.177554 0.258098 0.254310 0.258092
chargesum: 0.00000
title: Mulliken charges with hydrogens summed into heavy atoms:
elementType: S O C C C C
charge: 0.152109 -0.197225 -0.109600 0.090644 0.130647 -0.066574
polarizability: 8.33631304e+01 -2.01687929e+00 6.18193837e+01 4.82191839e-02 9.60458599e-03 3.98847462e+01
1716.lowfreq: -12.9589 -0.0029 -0.0029 -0.0011 9.5268 11.1525 51.4988 63.1687 115.4228
frequency: 51.4044 63.0735 115.4223 153.2437 175.5701 222.3348 286.7555 597.6668 667.2110 676.0949 780.9227 836.7395 890.6122 966.6401 982.7687 1010.5308 1088.3748 1142.4273 1241.1987 1259.8742 1323.6681 1351.2207 1375.0549 1431.0846 1449.7568 1456.8174 1462.6676 1642.1840 2864.7600 2961.8562 3000.7831 3003.0094 3025.4210 3096.2388 3113.3134 3129.7501
redmass: 2.9604 2.8742 4.0142 1.0855 1.7785 6.6833 4.1970 6.7741 7.2605 1.1506 4.5337 1.2281 3.0606 1.1855 1.2934 1.3985 2.5874 1.3094 1.2777 1.1419 1.5562 1.1835 1.2161 1.1016 1.0530 1.0811 1.0615 7.4278 1.0848 1.0617 1.0291 1.0969 1.0567 1.1082 1.1058 1.1024
irintensity: 10.4076 4.9409 9.5867 0.7377 1.3455 3.5332 3.8815 13.3957 2.4225 14.1940 0.1180 0.5954 13.8332 6.2024 6.4566 2.3149 4.9322 0.3083 6.3770 0.3766 57.3315 6.2210 6.8063 36.9887 16.3389 8.6670 9.7987 118.2296 152.1285 37.3525 34.6138 5.8171 14.9360 27.0815 19.0780 11.5822
temp: 298.150 k
press: 1.00000 atm
elementType: 16 8 6 6 6 6 1 1 1 1 1 1 1 1
symmnumber: 1
zpe: 292465.7 jmol-1
zpe.correction: 0.111394 hartree
zpe.thermalcorrener: 0.119638 hartree
zpe.thermalcorrenthalpy: 0.120582 hartree
zpe.thermalcorrgfe: 0.077433 hartree
zpe.sumelectzpe: -629.992896 hartree
zpe.sumelectthermal: -629.984653 hartree
zpe.sumelectthermalent: -629.983709 hartree
zpe.sumelectthermalfe: -630.026858 hartree
dipole: -0.8285 -0.9881 0.0139
dipole: 1.2896
quadrupole: -46.1585 -45.8558 -44.3804
quadrupole: -11.6561 0.0230 0.0107
quadrupole: -0.6936 -0.3910 1.0845 -11.6561 0.0230 0.0107
hfenergy: -630.1042907 hartree
pointgroup: C01 [X(C4H8O1S1)]
dipole: -0.3242737 -0.3902068 0.0000099 debye
dipolederiv: -0.2097092 0.0667713 0.0009544 0.0380473 -0.0176991 0.0026725 0.0006987 0.0033363 -0.1980526 -0.6373646 -0.0970625 -0.0019654 -0.2703761 -0.7440548 -0.0047816 -0.0029191 -0.0042479 -0.294974 0.2794977 0.1101918 0.0027886 0.1207961 -0.0193535 -0.0013426 0.0038256 -0.0013039 0.1506969 -0.467848 -0.1246262 -0.0040563 -0.4260874 -0.1171506 -0.0050411 -0.0107532 -0.0053013 0.1481492 1.0836445 0.1492408 0.0055426 0.223284 0.9301716 0.0080517 0.0060624 0.008535 0.0753969 0.0389671 -0.1311394 -0.0022069 -0.0941646 0.0830739 -0.000295 -0.0017881 -0.0007577 0.0815055 -0.0201911 -0.0344203 -0.0120718 -0.0336841 -0.0105811 -0.1011456 -0.0108141 -0.0925136 -0.0419864 -0.0192054 -0.035796 0.0107781 -0.0344339 -0.0168557 0.1011007 0.0089949 0.0924391 -0.0344286 0.0901078 -0.0236847 0.0060168 0.0779179 0.0507864 -0.090344 0.0250446 -0.1063766 -0.0094447 0.0888813 -0.0231308 -0.0059055 0.0786164 0.0439685 0.0928045 -0.020511 0.1086997 -0.0034633 -0.231808 0.1441488 -0.0000326 0.1869108 -0.1446614 -0.0011968 0.0000898 -0.0012963 0.097904 0.0652332 0.0162755 -0.0452195 0.0816657 -0.0517739 -0.1124153 -0.011347 -0.1079649 -0.0554759 -0.1245821 -0.0295981 -0.0024069 -0.0277614 0.0729116 -0.001368 -0.0024594 -0.0012604 0.1314564 0.0643769 0.0128299 0.0477844 0.0792694 -0.058782 0.1133005 0.0158757 0.1080127 -0.0472834 unknown
polarizability: 83.3795872|-1.9244697|61.7993025|0.1715392|0.2486491|39.8883706 unknown
InChI: InChI=1S/C4H8OS/c1-6-4-2-3-5/h3H,2,4H2,1H3
charge 0 multiplicity 1
14 atoms
S  -1.962847 -0.718213 -0.016997
O  2.482559 0.9394 0.0149
C  -0.295493 0.17445 0.007301
C  0.820541 -0.876685 -0.005803
C  2.220513 -0.28719 0.004714
C  -3.088807 0.788934 -0.001442
H  -0.236476 0.799627 0.914045
H  -0.227037 0.831059 -0.876208
H  0.738816 -1.533917 -0.898603
H  0.735261 -1.562286 0.864565
H  3.043641 -1.048774 0.00188
H  -2.925326 1.380573 0.913722
H  -4.122817 0.410492 -0.016046
H  -2.910527 1.40993 -0.894128
