program: Gaussian 09
title: 000217295
version: EM64L-G09RevD.01
frameworkgroup: C1[X(C16H15Cl2NO4)]
method: RPBEPBE
basis: SDD
operation: Freq
keyword: #p
keyword: freq=noraman
keyword: PBEPBE/SDD
title: #p freq=noraman PBEPBE/SDD
converged: YES YES NO NO
title: Mulliken charges:
elementType: Cl Cl O O O O N C C C C C C C C C C C C C C C C H H H H H H H H H H H H H H H
charge: -0.045116 -0.049220 -0.450773 -0.308966 -0.229826 -0.249873 -0.449124 0.027067 -0.545681 0.302657 0.119352 -0.195800 -0.384120 -0.239343 0.139778 0.550594 -0.468288 -0.310870 -0.250045 -0.064781 -0.025293 -0.271007 -0.663330 0.287639 0.247170 0.236287 0.279256 0.240986 0.387988 0.335278 0.259048 0.335546 0.224251 0.240872 0.285118 0.244645 0.237672 0.220253
chargesum: 0.00000
title: Mulliken charges with hydrogens summed into heavy atoms:
elementType: Cl Cl O O O O N C C C C C C C C C C C C C C C C
charge: -0.045116 -0.049220 -0.062785 -0.308966 -0.229826 -0.249873 -0.113846 0.027067 -0.010872 0.302657 0.119352 0.040487 -0.104865 0.001643 0.139778 0.550594 -0.209240 0.024676 0.215078 -0.064781 -0.025293 0.014110 0.039240
polarizability: 2.37537618e+02 -3.16510207e+00 2.50332005e+02 -1.01794987e+01 -1.81121262e+01 1.70150944e+02
1716.lowfreq: -4.7192 0.0014 0.0016 0.0020 2.9865 5.3245 9.5160 19.9564 28.3563
frequency: 9.3038 19.8384 28.3243 43.0980 55.6949 66.7612 73.7870 94.4156 111.7258 134.1823 145.1859 166.0060 176.9757 184.0861 202.9534 222.1803 239.9423 254.5518 264.7335 288.1163 302.1278 332.6599 347.0976 372.3100 377.8326 401.5213 414.7427 431.3570 446.9250 462.2729 492.5606 515.9602 550.9103 564.4908 569.9341 607.6609 648.7369 658.2832 673.8264 700.6255 723.1157 738.4333 751.3721 767.1178 812.9725 822.8811 837.3267 848.1875 861.1257 882.7300 901.2026 917.9090 934.8202 953.2836 976.6647 984.2077 996.8973 1010.6681 1017.5376 1036.1074 1049.6096 1094.2672 1096.8308 1105.5424 1111.6289 1155.5420 1157.9517 1176.3477 1221.6408 1234.4282 1253.3524 1267.2512 1279.2167 1313.2917 1339.0163 1348.1353 1365.0692 1373.4633 1392.7842 1393.1724 1408.2461 1439.0672 1447.7952 1456.7865 1465.3570 1484.6270 1513.2092 1580.6883 1581.2748 1604.5522 1611.6521 1628.4804 1639.1054 2968.9859 2993.5349 3033.6834 3041.3364 3089.5299 3094.6856 3120.9841 3128.4996 3137.6790 3153.3331 3162.6324 3193.2762 3201.7067 3482.7378 3510.3415
redmass: 7.5870 5.4851 3.6997 5.2622 4.6735 6.2904 5.2447 7.6744 6.1254 3.2572 6.0702 5.6418 4.7601 3.7991 4.7229 1.4785 2.8798 4.5025 4.9788 2.8242 2.5709 3.9755 5.6905 3.4231 10.9649 4.2238 6.6429 4.2239 4.4021 4.4374 5.0372 5.2261 4.3040 3.9601 4.7450 6.4688 2.4533 1.7176 2.2692 4.0082 1.7736 4.6284 8.3857 3.2414 1.9360 2.3475 3.7428 1.4213 1.5685 3.6372 7.6026 1.3899 3.0293 1.5031 5.9772 1.3202 2.5521 2.6978 2.8615 4.3408 4.3673 1.4680 2.1635 1.8142 2.1878 2.0336 1.9274 1.4624 1.6245 2.3679 1.2356 2.4746 1.1156 1.4194 1.6891 1.3287 1.8714 3.1351 1.4048 1.4943 3.6621 1.0904 3.6268 1.1012 1.0424 1.0514 2.2978 8.7826 4.7927 6.2597 9.4121 5.4773 5.8710 1.0661 1.0360 1.0590 1.0931 1.0975 1.1033 1.1069 1.0859 1.0916 1.0930 1.0998 1.0939 1.0938 1.0771 1.0638
irintensity: 0.1190 0.0351 1.9743 0.4629 4.3335 2.0736 1.3006 5.2791 5.2046 4.0221 4.7073 3.5911 4.8890 0.2703 0.3227 11.7366 1.2497 20.5685 4.8132 34.0848 66.0221 9.3087 23.3990 38.7676 17.2722 23.8306 15.3333 0.4049 3.7283 2.5592 10.8845 0.3917 1.6995 0.1895 5.1298 25.4581 13.1973 67.3803 9.7756 29.8054 54.2665 2.4330 74.6992 12.0087 13.7744 1.7463 14.3597 26.8336 28.9999 6.3054 33.3286 26.7306 34.1508 3.5927 9.8374 1.1132 6.4929 10.4515 19.8719 186.2909 95.4430 4.1993 27.9033 26.9494 10.2148 80.8968 64.2914 106.5040 24.3616 218.9686 1.3446 14.7449 3.1021 19.3972 20.5894 29.6910 122.4886 14.5974 9.8914 4.8148 45.3299 41.3382 110.9158 22.2546 16.9303 14.8352 331.6683 148.7883 264.9552 196.4354 86.9356 95.0686 17.4066 2.2463 15.5983 32.4127 9.4896 39.0859 1.7853 22.5186 0.5018 4.2669 2.1968 23.0357 3.2161 16.4147 40.3387 36.8833
temp: 298.150 k
press: 1.00000 atm
elementType: 17 17 8 8 8 8 7 6 6 6 6 6 6 6 6 6 6 6 6 6 6 6 6 1 1 1 1 1 1 1 1 1 1 1 1 1 1 1
symmnumber: 1
zpe: 731699.4 jmol-1
zpe.correction: 0.278690 hartree
zpe.thermalcorrener: 0.301489 hartree
zpe.thermalcorrenthalpy: 0.302433 hartree
zpe.thermalcorrgfe: 0.223035 hartree
zpe.sumelectzpe: -1892.788565 hartree
zpe.sumelectthermal: -1892.765766 hartree
zpe.sumelectthermalent: -1892.764822 hartree
zpe.sumelectthermalfe: -1892.844220 hartree
dipole: 0.7016 -2.5481 0.6239
dipole: 2.7155
quadrupole: -162.5633 -129.6551 -156.3952
quadrupole: 1.0578 -1.0695 8.9963
quadrupole: -13.0254 19.8827 -6.8573 1.0578 -1.0695 8.9963
hfenergy: -1893.0672547 hartree
pointgroup: C01 [X(C16H15Cl2N1O4)]
dipole: 0.218573 0.9720478 -0.3856877 debye
polarizability: 236.9805041|4.2262242|244.1117056|11.406785|-28.0631043|176.9283581 unknown
InChI: InChI=1S/C16H15Cl2NO4/c1-2-23-14(20)13-5-3-4-6-16(13,22)15(21)19-12-8-10(17)7-11(18)9-12/h3-5,7-9,19,22H,2,6H2,1H3
charge 0 multiplicity 1
38 atoms
Cl -4.365358 -2.817082 1.570678
Cl -5.005862 1.535819 -1.816009
O  2.865498 0.047132 2.077537
O  2.740019 -1.611022 -0.102673
O  0.396248 -1.082144 1.965495
O  3.397247 -0.554063 -2.080217
N  -0.45642 0.546788 0.499267
C  1.920761 0.719157 1.198327
C  1.7859 2.148065 1.815505
C  2.417269 0.752655 -0.261022
C  0.545675 -0.044187 1.264758
C  1.557344 3.284815 0.846513
C  2.373377 1.902948 -1.012349
C  1.851717 3.164174 -0.485383
C  2.911158 -0.487904 -0.923476
C  -1.802712 0.128616 0.333254
C  -2.625065 0.911694 -0.523239
C  -2.333036 -1.020016 0.981428
C  3.098734 -2.94022 -0.691363
C  -3.678657 -1.347442 0.745075
C  -3.961109 0.528895 -0.715835
C  -4.528162 -0.601509 -0.09586
C  1.901709 -3.533172 -1.438047
H  2.742802 2.332189 2.348762
H  1.011232 2.134982 2.603787
H  1.223141 4.243728 1.261357
H  2.731595 1.855653 -2.047805
H  1.744267 4.016027 -1.164988
H  2.741861 -0.933208 1.95602
H  -0.184689 1.389251 -0.019006
H  -2.227699 1.797678 -1.028824
H  -1.70208 -1.617384 1.640234
H  3.381745 -3.544093 0.185426
H  3.967325 -2.799432 -1.357625
H  -5.57005 -0.884072 -0.258524
H  1.643829 -2.921201 -2.318795
H  1.021189 -3.601594 -0.776491
H  2.151654 -4.551524 -1.789293
