program: Gaussian 09
title: 000217294
version: EM64L-G09RevD.01
frameworkgroup: C1[X(C16H13Cl2NO4)]
method: RPBEPBE
basis: SDD
operation: Freq
keyword: #p
keyword: freq=noraman
keyword: PBEPBE/SDD
title: #p freq=noraman PBEPBE/SDD
converged: YES YES NO NO
title: Mulliken charges:
elementType: Cl Cl O O O O N C C C C C C C C C C C C C C C C H H H H H H H H H H H H H
charge: -0.048583 -0.015342 -0.291263 -0.372502 -0.213272 -0.220023 -0.491991 0.311074 0.126975 -0.433354 -0.351996 0.181139 0.123331 0.704876 -0.399169 0.180834 -0.305281 -0.253454 -0.235227 -0.237182 -0.219043 -0.255204 -0.665587 0.315782 0.248673 0.225341 0.315499 0.260661 0.260068 0.242070 0.233587 0.224339 0.360361 0.216687 0.228275 0.248900
chargesum: 0.00000
title: Mulliken charges with hydrogens summed into heavy atoms:
elementType: Cl Cl O O O O N C C C C C C C C C C C C C C C C
charge: -0.048583 -0.015342 -0.291263 -0.012141 -0.213272 -0.220023 -0.176492 0.311074 0.126975 -0.117571 -0.103323 0.181139 0.123331 0.704876 -0.173828 0.180834 -0.305281 -0.253454 0.025434 0.022886 0.023027 0.202721 0.028275
polarizability: 3.18515671e+02 -2.39501172e+01 1.97230927e+02 7.98863783e+00 6.03440404e+00 1.67977539e+02
1716.lowfreq: -5.6320 -3.8583 -0.0023 -0.0014 -0.0006 3.6363 13.4670 17.6358 27.0645
frequency: 13.2643 17.6217 27.0210 38.7172 55.5429 73.9201 79.0545 96.4864 97.2208 127.9678 140.0270 163.7548 195.3351 197.6499 218.7951 251.6416 254.2620 279.2642 292.9802 318.8621 328.1858 364.7560 375.4415 384.3225 397.7939 414.3131 442.6507 455.0849 486.2566 504.8203 510.3219 520.0079 538.1055 568.3892 590.8659 641.6386 668.7983 672.1046 703.4371 729.9049 741.9421 751.5218 768.5232 769.2249 794.5500 812.1907 815.8042 831.3650 865.7322 891.9671 912.5347 949.3227 962.8351 975.0127 999.2437 1035.2878 1049.8482 1067.7857 1093.7310 1095.6410 1108.8081 1153.7959 1155.9373 1174.1963 1190.7938 1198.5804 1259.4667 1261.9400 1269.0147 1279.0547 1294.9510 1355.8627 1356.4616 1389.6638 1391.0474 1406.1295 1414.3116 1452.1215 1456.1561 1463.3158 1466.7363 1484.4450 1493.6563 1566.7293 1585.0837 1593.0385 1604.4277 1623.5653 1636.8545 2992.3880 3028.8497 3087.6612 3092.4858 3116.7208 3118.3519 3146.3368 3155.2117 3174.0445 3185.7798 3186.1413 3511.1283 3546.4949
redmass: 5.4511 6.0024 8.9019 5.7399 4.7149 7.3965 4.2568 8.4884 6.7129 5.3079 7.1737 5.9616 3.5345 3.4639 2.1673 3.8406 6.2688 6.1070 6.5541 4.2060 4.5404 13.1806 8.2184 7.4817 3.2255 1.3637 3.6754 3.7865 3.8098 3.2867 5.1558 1.9473 4.5732 2.8699 5.9469 6.6287 5.8775 6.3691 4.4822 5.7335 6.0769 3.6035 3.8542 1.4010 4.8394 1.6073 1.6024 3.8296 5.6398 1.3547 4.8016 1.4308 1.3306 1.4361 2.8976 4.3844 4.3771 3.1438 2.5824 2.1565 1.8101 1.6826 1.3625 1.1716 1.7778 1.9265 4.3849 2.5221 2.2485 1.1243 1.4502 1.2859 5.6075 1.2490 4.0548 5.8305 2.5849 2.8123 1.1135 1.0433 2.3395 1.0517 2.8868 6.1690 6.5742 8.2003 6.9747 7.9899 9.1896 1.0360 1.0595 1.0973 1.1032 1.0883 1.1058 1.0959 1.0872 1.0930 1.0998 1.0918 1.0759 1.0659
irintensity: 1.0579 0.3319 1.5997 0.2979 2.8059 4.5061 0.5512 0.4589 0.8661 1.7561 2.0642 1.7113 3.9451 2.8867 1.4254 1.6454 3.6914 3.4340 2.5192 5.1758 6.2727 5.2840 1.1445 7.7498 34.4651 93.0006 7.7355 6.7082 10.4780 19.1317 0.8158 66.1615 23.1378 18.4086 25.5740 1.5328 30.1713 15.5279 19.5316 22.6513 82.9698 16.5001 6.7141 57.7218 10.5734 18.6455 18.8089 3.8459 12.4757 0.0683 19.2342 0.7824 0.9653 8.9215 10.3119 270.6947 6.8258 6.6735 16.7908 30.3630 263.2452 54.6078 5.4812 11.9719 189.0082 246.1427 313.5513 12.2871 69.5869 1.6128 1.0572 3.4281 116.8846 24.7265 12.2601 10.3571 73.7214 26.2346 43.6971 14.4077 428.1240 11.2788 33.9103 29.2470 27.6931 16.3787 33.0845 153.0927 267.4489 21.2185 35.2259 41.8961 0.5332 16.1922 28.0619 9.8942 2.8872 1.0550 6.8660 4.4537 22.4256 52.9984
temp: 298.150 k
press: 1.00000 atm
elementType: 17 17 8 8 8 8 7 6 6 6 6 6 6 6 6 6 6 6 6 6 6 6 6 1 1 1 1 1 1 1 1 1 1 1 1 1
symmnumber: 1
zpe: 674983.3 jmol-1
zpe.correction: 0.257088 hartree
zpe.thermalcorrener: 0.279183 hartree
zpe.thermalcorrenthalpy: 0.280127 hartree
zpe.thermalcorrgfe: 0.202051 hartree
zpe.sumelectzpe: -1891.635648 hartree
zpe.sumelectthermal: -1891.613552 hartree
zpe.sumelectthermalent: -1891.612608 hartree
zpe.sumelectthermalfe: -1891.690684 hartree
dipole: 2.8680 3.1030 0.3154
dipole: 4.2371
quadrupole: -133.8520 -127.1333 -147.5891
quadrupole: 1.4763 3.1960 -7.5900
quadrupole: 2.3395 9.0582 -11.3976 1.4763 3.1960 -7.5900
hfenergy: -1891.8927352 hartree
pointgroup: C01 [X(C16H13Cl2N1O4)]
dipole: -1.09549 0.929477 -0.8455403 debye
polarizability: 319.5218931|22.2191134|180.5549358|-4.946298|-15.1564742|183.6473085 unknown
InChI: InChI=1S/C16H13Cl2NO4/c1-2-23-16(22)10-8-9(6-7-13(10)20)15(21)19-14-11(17)4-3-5-12(14)18/h3-8,19-20H,2H2,1H3
charge 0 multiplicity 1
36 atoms
Cl -3.347407 -0.531042 -2.838199
Cl -3.10998 0.882877 2.567926
O  3.86638 -1.349781 1.053094
O  4.181305 2.459016 -0.822957
O  -0.932355 -0.932842 1.22685
O  5.301679 0.013342 -0.182241
N  -1.984952 0.481879 -0.321588
C  0.433889 0.683907 0.032884
C  2.905827 0.55667 -0.002952
C  1.640562 -0.005289 0.290185
C  0.497011 1.995779 -0.506524
C  2.947717 1.875747 -0.554698
C  -0.854708 0.002588 0.383963
C  -3.30678 0.02503 -0.097819
C  1.739766 2.583271 -0.792373
C  4.151327 -0.234203 0.246547
C  -4.092332 -0.482497 -1.169047
C  -3.945727 0.088261 1.171339
C  -5.408583 -0.943283 -1.007576
C  -5.252137 -0.395726 1.374147
C  -5.982232 -0.915276 0.283423
C  5.010283 -2.266062 1.337072
C  5.166706 -3.302835 0.220434
H  1.593926 -1.003329 0.732783
H  -0.416475 2.580465 -0.661703
H  1.782933 3.605623 -1.189669
H  -1.811702 0.93256 -1.224367
H  -5.964722 -1.327191 -1.866611
H  -5.696804 -0.341984 2.37149
H  -7.000273 -1.285942 0.435444
H  5.926179 -1.660175 1.45262
H  4.735299 -2.730338 2.297622
H  4.064274 3.375834 -1.182048
H  5.959504 -4.024747 0.491617
H  4.227631 -3.862448 0.068533
H  5.453075 -2.817555 -0.727604
