program: Gaussian 09
title: 000217200
version: EM64L-G09RevD.01
frameworkgroup: C1[X(C11H7N5O4)]
method: RPBEPBE
basis: SDD
operation: Freq
keyword: #p
keyword: freq=noraman
keyword: PBEPBE/SDD
title: #p freq=noraman PBEPBE/SDD
converged: NO NO NO NO
title: Mulliken charges:
elementType: O O O O N N N N N C C C C C C C C C C C H H H H H H H
charge: -0.236325 -0.222679 -0.190779 -0.202486 0.017102 -0.001993 -0.086986 -0.362766 0.011953 0.009845 0.255805 0.412494 -0.538507 -0.567761 0.419754 0.146632 0.346575 -0.406952 -0.774158 -0.060290 0.332787 0.300750 0.291306 0.253614 0.228267 0.253595 0.371205
chargesum: 0.00000
title: Mulliken charges with hydrogens summed into heavy atoms:
elementType: O O O O N N N N N C C C C C C C C C C C
charge: -0.236325 -0.222679 -0.190779 -0.202486 0.017102 -0.001993 -0.086986 0.008439 0.011953 0.009845 0.255805 0.412494 -0.205720 -0.267011 0.419754 0.146632 0.346575 -0.115646 -0.038682 -0.060290
polarizability: 2.88433151e+02 5.65790494e+00 1.94629471e+02 -2.96601969e-03 1.44539086e-02 6.76309517e+01
1716.lowfreq: -6.7843 -2.9413 -0.0006 0.0003 0.0009 11.2106 32.7310 44.1197 63.0764
frequency: 32.6864 44.0261 62.8777 80.0614 90.1098 102.8789 128.3265 161.3577 163.3025 220.3972 226.3109 247.1973 254.8969 313.1447 354.3455 360.9188 414.8984 466.1384 479.9827 497.5446 525.9374 538.4379 550.9791 601.6303 622.2306 646.4918 677.3458 701.3833 720.1984 739.8950 752.4682 767.1554 779.8029 859.7272 880.4709 891.8484 898.4698 932.3543 944.3021 953.4292 970.1008 989.4625 1011.9818 1051.8458 1053.4528 1082.0749 1111.6568 1147.1783 1170.7054 1187.8423 1209.1724 1214.4926 1245.0449 1275.7550 1328.4908 1364.3755 1398.4556 1402.5546 1408.1772 1419.2703 1454.5196 1459.6829 1463.1267 1476.5411 1564.5438 1595.5299 1610.1396 1634.8177 2997.0666 3076.6059 3111.9783 3177.6920 3180.2073 3188.6306 3596.3032
redmass: 8.1624 9.2285 12.9732 8.1666 1.0631 7.8955 5.2132 6.1794 10.7478 3.8092 3.8868 9.0813 6.8937 8.8593 8.6634 8.5002 8.5181 7.6513 4.0090 11.1824 6.3916 4.5386 5.5684 9.8913 5.1593 11.9540 5.0179 9.6871 5.1089 1.9388 2.0559 7.8106 4.5237 7.7361 6.5144 7.0666 1.5274 1.3593 8.1060 5.9684 1.4656 9.0257 1.6734 4.9687 1.5455 1.6319 7.2769 5.0952 4.9002 2.5448 7.4244 4.7061 1.6973 2.7787 6.1620 12.0236 2.1509 1.5658 1.6371 5.1569 6.3620 1.0430 6.6246 1.2396 9.7409 8.5984 7.5993 8.7436 1.0372 1.0969 1.1007 1.0923 1.0928 1.0931 1.0851
irintensity: 0.0002 5.7599 0.3559 1.2683 0.0126 0.1646 1.3173 9.5593 3.3228 1.8857 0.0125 0.0910 0.8240 5.6896 0.5107 3.6887 4.4716 2.6451 0.2458 2.3967 6.9070 0.0641 4.9708 0.5856 12.9131 1.8674 0.3995 18.0562 14.2710 58.2410 68.7638 4.1797 8.2889 24.0654 2.1525 17.9149 35.5401 11.9639 6.6596 1.5075 18.6025 32.8492 0.2502 21.9156 10.1666 91.5628 13.2025 1.5200 30.6325 16.7296 369.6423 25.4878 65.1585 72.9596 151.9020 124.6064 5.8040 31.7615 9.9573 22.8727 34.4101 16.4687 36.1806 10.0192 219.5373 1.8033 76.1294 81.2091 9.3210 7.9967 14.5164 3.8918 14.0702 3.4263 171.8042
temp: 298.150 k
press: 1.00000 atm
elementType: 8 8 8 8 7 7 7 7 7 6 6 6 6 6 6 6 6 6 6 6 1 1 1 1 1 1 1
symmnumber: 1
zpe: 468430.3 jmol-1
zpe.correction: 0.178416 hartree
zpe.thermalcorrener: 0.194629 hartree
zpe.thermalcorrenthalpy: 0.195574 hartree
zpe.thermalcorrgfe: 0.133052 hartree
zpe.sumelectzpe: -996.489752 hartree
zpe.sumelectthermal: -996.473538 hartree
zpe.sumelectthermalent: -996.472594 hartree
zpe.sumelectthermalfe: -996.535116 hartree
dipole: -7.7380 -2.3279 0.0003
dipole: 8.0806
quadrupole: -115.2967 -126.8065 -111.8587
quadrupole: -16.7957 0.0068 -0.0027
quadrupole: 2.6906 -8.8192 6.1286 -16.7957 0.0068 -0.0027
hfenergy: -996.6681675 hartree
pointgroup: C01 [X(C11H7N5O4)]
dipole: 3.041412 0.9255916 0.0001019 debye
polarizability: 288.3960565|5.9573552|194.6665652|0.0030122|-0.0144444|67.6309517 unknown
InChI: InChI=1S/C11H7N5O4/c1-5-2-6(16(18)19)3-7-8(17)4-9(20-10(5)7)11-12-14-15-13-11/h2-4,14H,1H3
charge 0 multiplicity 1
27 atoms
O  1.028822 0.705881 0.000021
O  -0.439172 -3.210722 0.000307
O  -5.071489 -1.167118 -0.000186
O  -5.290644 1.105896 -0.000686
N  -4.578072 0.025777 -0.00015
N  4.318439 -0.909008 0.000164
N  3.739818 1.326888 -0.000069
N  5.395523 -0.078361 -0.000366
N  5.092584 1.284324 -0.000408
C  -0.359322 0.486048 0.000019
C  -0.900068 -0.827893 0.000183
C  -1.158914 1.663341 -0.000195
C  -2.305572 -0.982303 0.000118
C  -2.552413 1.478638 -0.000264
C  -3.101582 0.17077 -0.000098
C  0.002196 -2.016077 0.000468
C  1.883365 -0.398374 0.000087
C  1.432746 -1.69661 0.000256
C  -0.519835 3.03397 -0.000277
C  3.290201 0.000775 -0.000046
H  -2.740447 -1.985603 0.000256
H  -3.231656 2.335255 -0.000444
H  2.15624 -2.515318 0.000271
H  0.129904 3.169331 -0.883101
H  -1.286697 3.824373 -0.001581
H  0.127822 3.170334 0.883941
H  6.356424 -0.422213 -0.000519
